Build failed in Jenkins: OpenJPA-2.2.x #1

classic Classic list List threaded Threaded
4 messages Options
Reply | Threaded
Open this post in threaded view
|  
Report Content as Inappropriate

Build failed in Jenkins: OpenJPA-2.2.x #1

Apache Jenkins Server-2
See <https://builds.apache.org/job/OpenJPA-2.2.x/1/display/redirect>

------------------------------------------
[...truncated 573.29 KB...]
AU        openjpa-persistence-jdbc/src/test/resources/org/apache/openjpa/persistence/common/apps/META-INF/persistence.xml
A         openjpa-persistence-jdbc/src/test/resources/org/apache/openjpa/persistence/inheritance
AU        openjpa-persistence-jdbc/src/test/resources/org/apache/openjpa/persistence/inheritance/orm.xml
A         openjpa-persistence-jdbc/src/test/resources/org/apache/openjpa/persistence/querycache
A         openjpa-persistence-jdbc/src/test/resources/org/apache/openjpa/persistence/querycache/common
A         openjpa-persistence-jdbc/src/test/resources/org/apache/openjpa/persistence/querycache/common/apps
A         openjpa-persistence-jdbc/src/test/resources/org/apache/openjpa/persistence/querycache/common/apps/META-INF
AU        openjpa-persistence-jdbc/src/test/resources/org/apache/openjpa/persistence/querycache/common/apps/META-INF/persistence.xml
A         openjpa-persistence-jdbc/src/test/resources/org/apache/openjpa/persistence/puconf
A         openjpa-persistence-jdbc/src/test/resources/org/apache/openjpa/persistence/puconf/META-INF
AU        openjpa-persistence-jdbc/src/test/resources/org/apache/openjpa/persistence/puconf/META-INF/persistence.xml
A         openjpa-persistence-jdbc/src/test/resources/org/apache/openjpa/persistence/validation
AU        openjpa-persistence-jdbc/src/test/resources/org/apache/openjpa/persistence/validation/persistence.xml
AU        openjpa-persistence-jdbc/src/test/resources/org/apache/openjpa/persistence/orm.xml
A         openjpa-persistence-jdbc/src/test/resources/org/apache/openjpa/persistence/annotations
A         openjpa-persistence-jdbc/src/test/resources/org/apache/openjpa/persistence/annotations/xml
AU        openjpa-persistence-jdbc/src/test/resources/org/apache/openjpa/persistence/annotations/xml/orm.xml
A         openjpa-persistence-jdbc/src/test/resources/org/apache/openjpa/persistence/annotations/common
A         openjpa-persistence-jdbc/src/test/resources/org/apache/openjpa/persistence/annotations/common/apps
A         openjpa-persistence-jdbc/src/test/resources/org/apache/openjpa/persistence/annotations/common/apps/annotApp
A         openjpa-persistence-jdbc/src/test/resources/org/apache/openjpa/persistence/annotations/common/apps/annotApp/annotype
A         openjpa-persistence-jdbc/src/test/resources/org/apache/openjpa/persistence/annotations/common/apps/annotApp/annotype/META-INF
AU        openjpa-persistence-jdbc/src/test/resources/org/apache/openjpa/persistence/annotations/common/apps/annotApp/annotype/META-INF/persistence.xml
AU        openjpa-persistence-jdbc/src/test/resources/org/apache/openjpa/persistence/annotations/common/apps/annotApp/annotype/META-INF/orm.xml
A         openjpa-persistence-jdbc/src/test/resources/org/apache/openjpa/persistence/annotations/common/apps/annotApp/ddtype
A         openjpa-persistence-jdbc/src/test/resources/org/apache/openjpa/persistence/annotations/common/apps/annotApp/ddtype/META-INF
AU        openjpa-persistence-jdbc/src/test/resources/org/apache/openjpa/persistence/annotations/common/apps/annotApp/ddtype/META-INF/orm.xml
AU        openjpa-persistence-jdbc/src/test/resources/org/apache/openjpa/persistence/annotations/common/apps/annotApp/ddtype/META-INF/persistence.xml
A         openjpa-persistence-jdbc/src/test/resources/org/apache/openjpa/persistence/datacache
A         openjpa-persistence-jdbc/src/test/resources/org/apache/openjpa/persistence/datacache/common
A         openjpa-persistence-jdbc/src/test/resources/org/apache/openjpa/persistence/datacache/common/apps
A         openjpa-persistence-jdbc/src/test/resources/org/apache/openjpa/persistence/datacache/common/apps/META-INF
AU        openjpa-persistence-jdbc/src/test/resources/org/apache/openjpa/persistence/datacache/common/apps/META-INF/persistence.xml
A         openjpa-persistence-jdbc/src/test/resources/org/apache/openjpa/persistence/entityoperation
A         openjpa-persistence-jdbc/src/test/resources/org/apache/openjpa/persistence/entityoperation/common
A         openjpa-persistence-jdbc/src/test/resources/org/apache/openjpa/persistence/entityoperation/common/apps
A         openjpa-persistence-jdbc/src/test/resources/org/apache/openjpa/persistence/entityoperation/common/apps/META-INF
AU        openjpa-persistence-jdbc/src/test/resources/org/apache/openjpa/persistence/entityoperation/common/apps/META-INF/persistence.xml
A         openjpa-persistence-jdbc/src/test/resources/org/apache/openjpa/persistence/xml
AU        openjpa-persistence-jdbc/src/test/resources/org/apache/openjpa/persistence/xml/persistence-2_0-orm-2_0.xml
AU        openjpa-persistence-jdbc/src/test/resources/org/apache/openjpa/persistence/xml/orm.xml
AU        openjpa-persistence-jdbc/src/test/resources/org/apache/openjpa/persistence/xml/orm_2_0.xml
AU        openjpa-persistence-jdbc/src/test/resources/org/apache/openjpa/persistence/xml/persistence-2_0-no-pu.xml
AU        openjpa-persistence-jdbc/src/test/resources/org/apache/openjpa/persistence/xml/toone-orm.xml
AU        openjpa-persistence-jdbc/src/test/resources/org/apache/openjpa/persistence/xml/persistence-without-xsd.xml
AU        openjpa-persistence-jdbc/src/test/resources/org/apache/openjpa/persistence/xml/persistence-2_0.xml
AU        openjpa-persistence-jdbc/src/test/resources/org/apache/openjpa/persistence/xml/persistence-1_0-orm-2_0.xml
AU        openjpa-persistence-jdbc/src/test/resources/org/apache/openjpa/persistence/xml/persistence-2_0-orm-1_0.xml
A         openjpa-persistence-jdbc/src/test/resources/org/apache/openjpa/persistence/access
AU        openjpa-persistence-jdbc/src/test/resources/org/apache/openjpa/persistence/access/access-pudef-prop-orm.xml
AU        openjpa-persistence-jdbc/src/test/resources/org/apache/openjpa/persistence/access/access-orm.xml
AU        openjpa-persistence-jdbc/src/test/resources/org/apache/openjpa/persistence/access/access-pudef-field-orm.xml
AU        openjpa-persistence-jdbc/src/test/resources/org/apache/openjpa/persistence/access/access-def-persistence.xml
AU        openjpa-persistence-jdbc/src/test/resources/org/apache/openjpa/persistence/access/access-persistence.xml
AU        openjpa-persistence-jdbc/src/test/resources/org/apache/openjpa/persistence/access/access-pudef-persistence.xml
AU        openjpa-persistence-jdbc/src/test/resources/org/apache/openjpa/persistence/access/access-def-prop-orm.xml
AU        openjpa-persistence-jdbc/src/test/resources/org/apache/openjpa/persistence/access/access-def-field-orm.xml
A         openjpa-persistence-jdbc/src/test/resources/org/apache/openjpa/persistence/enhance
A         openjpa-persistence-jdbc/src/test/resources/org/apache/openjpa/persistence/enhance/common
A         openjpa-persistence-jdbc/src/test/resources/org/apache/openjpa/persistence/enhance/common/apps
A         openjpa-persistence-jdbc/src/test/resources/org/apache/openjpa/persistence/enhance/common/apps/META-INF
AU        openjpa-persistence-jdbc/src/test/resources/org/apache/openjpa/persistence/enhance/common/apps/META-INF/persistence.xml
A         openjpa-persistence-jdbc/src/test/resources/org/apache/openjpa/persistence/enhance/identity
AU        openjpa-persistence-jdbc/src/test/resources/org/apache/openjpa/persistence/enhance/identity/mapsId-orm.xml
A         openjpa-persistence-jdbc/src/test/resources/org/apache/openjpa/persistence/jdbc
A         openjpa-persistence-jdbc/src/test/resources/org/apache/openjpa/persistence/jdbc/unique
AU        openjpa-persistence-jdbc/src/test/resources/org/apache/openjpa/persistence/jdbc/unique/orm.xml
AU        openjpa-persistence-jdbc/src/test/resources/org/apache/openjpa/persistence/jdbc/unique/named-constraint-orm.xml
A         openjpa-persistence-jdbc/src/test/resources/org/apache/openjpa/persistence/jdbc/common
A         openjpa-persistence-jdbc/src/test/resources/org/apache/openjpa/persistence/jdbc/common/apps
A         openjpa-persistence-jdbc/src/test/resources/org/apache/openjpa/persistence/jdbc/common/apps/mappingApp
A         openjpa-persistence-jdbc/src/test/resources/org/apache/openjpa/persistence/jdbc/common/apps/mappingApp/META-INF
AU        openjpa-persistence-jdbc/src/test/resources/org/apache/openjpa/persistence/jdbc/common/apps/mappingApp/META-INF/persistence.xml
A         openjpa-persistence-jdbc/src/test/resources/org/apache/openjpa/persistence/jdbc/common/apps/META-INF
AU        openjpa-persistence-jdbc/src/test/resources/org/apache/openjpa/persistence/jdbc/common/apps/META-INF/persistence.xml
A         openjpa-persistence-jdbc/src/test/resources/org/apache/openjpa/persistence/jdbc/order
AU        openjpa-persistence-jdbc/src/test/resources/org/apache/openjpa/persistence/jdbc/order/order-persistence-2.xml
AU        openjpa-persistence-jdbc/src/test/resources/org/apache/openjpa/persistence/jdbc/order/order-persistence-3.xml
AU        openjpa-persistence-jdbc/src/test/resources/org/apache/openjpa/persistence/jdbc/order/order-persistence.xml
AU        openjpa-persistence-jdbc/src/test/resources/org/apache/openjpa/persistence/jdbc/order/order-persistence-4.xml
AU        openjpa-persistence-jdbc/src/test/resources/org/apache/openjpa/persistence/jdbc/order/order-persistence-5.xml
AU        openjpa-persistence-jdbc/src/test/resources/org/apache/openjpa/persistence/jdbc/order/order-orm-2.xml
AU        openjpa-persistence-jdbc/src/test/resources/org/apache/openjpa/persistence/jdbc/order/order-orm-3.xml
AU        openjpa-persistence-jdbc/src/test/resources/org/apache/openjpa/persistence/jdbc/order/order-orm.xml
A         openjpa-persistence-jdbc/src/test/resources/org/apache/openjpa/persistence/jdbc/xml
A         openjpa-persistence-jdbc/src/test/resources/org/apache/openjpa/persistence/query
A         openjpa-persistence-jdbc/src/test/resources/org/apache/openjpa/persistence/query/common
A         openjpa-persistence-jdbc/src/test/resources/org/apache/openjpa/persistence/query/common/apps
A         openjpa-persistence-jdbc/src/test/resources/org/apache/openjpa/persistence/query/common/apps/META-INF
AU        openjpa-persistence-jdbc/src/test/resources/org/apache/openjpa/persistence/query/common/apps/META-INF/persistence.xml
A         openjpa-persistence-jdbc/src/test/resources/org/apache/openjpa/conf
A         openjpa-persistence-jdbc/src/test/resources/org/apache/openjpa/conf/META-INF
AU        openjpa-persistence-jdbc/src/test/resources/org/apache/openjpa/conf/META-INF/persistence-2_0-config.xml
A         openjpa-persistence-jdbc/src/test/resources/org/apache/openjpa/lib
A         openjpa-persistence-jdbc/src/test/resources/org/apache/openjpa/lib/conf
A         openjpa-persistence-jdbc/src/test/resources/org/apache/openjpa/lib/conf/META-INF
AU        openjpa-persistence-jdbc/src/test/resources/org/apache/openjpa/lib/conf/META-INF/persistence-config.xml
AU        openjpa-persistence-jdbc/src/test/resources/org/apache/openjpa/lib/conf/product-derivations-load.xml
A         openjpa-persistence-jdbc/src/test/resources/simple-jndi
A         openjpa-persistence-jdbc/src/test/resources/simple-jndi/jdbc
AU        openjpa-persistence-jdbc/src/test/resources/simple-jndi/jdbc/default.properties
A         openjpa-persistence-jdbc/src/test/resources/j2.security.test.policy
A         openjpa-persistence-jdbc/src/test/resources/j2.security.jse.policy
AU        openjpa-persistence-jdbc/src/test/resources/jndi.properties
A         openjpa-persistence-jdbc/src/test/resources/META-INF
AU        openjpa-persistence-jdbc/src/test/resources/META-INF/fetch-groups-orm.xml
AU        openjpa-persistence-jdbc/src/test/resources/META-INF/caching-persistence-invalid.xml
AU        openjpa-persistence-jdbc/src/test/resources/META-INF/delimited-identifiers-result-set-orm.xml
AU        openjpa-persistence-jdbc/src/test/resources/META-INF/nonstandard-orm.xml
AU        openjpa-persistence-jdbc/src/test/resources/META-INF/persistence2.xml
AU        openjpa-persistence-jdbc/src/test/resources/META-INF/persistence3.xml
A         openjpa-persistence-jdbc/src/test/resources/META-INF/pudefaults-orm.xml
AU        openjpa-persistence-jdbc/src/test/resources/META-INF/foreign-key-orm.xml
AU        openjpa-persistence-jdbc/src/test/resources/META-INF/cascade-persist.xml
AU        openjpa-persistence-jdbc/src/test/resources/META-INF/query-result-orm.xml
AU        openjpa-persistence-jdbc/src/test/resources/META-INF/caching-persistence.xml
AU        openjpa-persistence-jdbc/src/test/resources/META-INF/delimited-identifiers-joins-orm.xml
AU        openjpa-persistence-jdbc/src/test/resources/META-INF/listener-orm.xml
AU        openjpa-persistence-jdbc/src/test/resources/META-INF/nopriv_persistence.xml
AU        openjpa-persistence-jdbc/src/test/resources/META-INF/table-orm.xml
AU        openjpa-persistence-jdbc/src/test/resources/META-INF/delimited-identifiers-inheritance-xml-orm.xml
AU        openjpa-persistence-jdbc/src/test/resources/META-INF/persistence.xml
AU        openjpa-persistence-jdbc/src/test/resources/META-INF/caching-orm.xml
A         openjpa-persistence-jdbc/src/test/resources/META-INF/pudefaults2-orm.xml
AU        openjpa-persistence-jdbc/src/test/resources/META-INF/delimited-identifiers-seq-gen-xml-orm.xml
AU        openjpa-persistence-jdbc/src/test/resources/META-INF/arrays-orm.xml
AU        openjpa-persistence-jdbc/src/test/resources/META-INF/delimited-identifiers-xml-orm.xml
AU        openjpa-persistence-jdbc/src/test/resources/META-INF/version-columns-orm.xml
AU        openjpa-persistence-jdbc/src/test/resources/META-INF/delim_persistence.xml
AU        openjpa-persistence-jdbc/src/test/resources/META-INF/delimited-identifiers-orm.xml
AU        openjpa-persistence-jdbc/src/test/resources/META-INF/optidcpy_persistence.xml
A         openjpa-persistence-jdbc/src/main
A         openjpa-persistence-jdbc/src/main/appended-resources
A         openjpa-persistence-jdbc/src/main/appended-resources/META-INF
AU        openjpa-persistence-jdbc/src/main/appended-resources/META-INF/NOTICE.vm
A         openjpa-persistence-jdbc/src/main/resources
A         openjpa-persistence-jdbc/src/main/resources/META-INF
A         openjpa-persistence-jdbc/src/main/resources/META-INF/services
A         openjpa-persistence-jdbc/src/main/resources/META-INF/services/org.apache.openjpa.lib.conf.ProductDerivation
A         openjpa-persistence-jdbc/src/main/resources/org
A         openjpa-persistence-jdbc/src/main/resources/org/apache
A         openjpa-persistence-jdbc/src/main/resources/org/apache/openjpa
A         openjpa-persistence-jdbc/src/main/resources/org/apache/openjpa/persistence
A         openjpa-persistence-jdbc/src/main/resources/org/apache/openjpa/persistence/jdbc
AU        openjpa-persistence-jdbc/src/main/resources/org/apache/openjpa/persistence/jdbc/localizer.properties
A         openjpa-persistence-jdbc/src/main/java
A         openjpa-persistence-jdbc/src/main/java/org
A         openjpa-persistence-jdbc/src/main/java/org/apache
A         openjpa-persistence-jdbc/src/main/java/org/apache/openjpa
A         openjpa-persistence-jdbc/src/main/java/org/apache/openjpa/persistence
A         openjpa-persistence-jdbc/src/main/java/org/apache/openjpa/persistence/jdbc
AU        openjpa-persistence-jdbc/src/main/java/org/apache/openjpa/persistence/jdbc/Strategy.java
AU        openjpa-persistence-jdbc/src/main/java/org/apache/openjpa/persistence/jdbc/VersionColumn.java
AU        openjpa-persistence-jdbc/src/main/java/org/apache/openjpa/persistence/jdbc/XJoinColumn.java
AU        openjpa-persistence-jdbc/src/main/java/org/apache/openjpa/persistence/jdbc/Unique.java
AU        openjpa-persistence-jdbc/src/main/java/org/apache/openjpa/persistence/jdbc/KeyJoinColumns.java
AU        openjpa-persistence-jdbc/src/main/java/org/apache/openjpa/persistence/jdbc/ElementForeignKey.java
AU        openjpa-persistence-jdbc/src/main/java/org/apache/openjpa/persistence/jdbc/KeyEmbeddedMapping.java
AU        openjpa-persistence-jdbc/src/main/java/org/apache/openjpa/persistence/jdbc/Columns.java
AU        openjpa-persistence-jdbc/src/main/java/org/apache/openjpa/persistence/jdbc/DataStoreIdColumn.java
AU        openjpa-persistence-jdbc/src/main/java/org/apache/openjpa/persistence/jdbc/ElementIndex.java
AU        openjpa-persistence-jdbc/src/main/java/org/apache/openjpa/persistence/jdbc/KeyJoinColumn.java
AU        openjpa-persistence-jdbc/src/main/java/org/apache/openjpa/persistence/jdbc/VersionColumns.java
AU        openjpa-persistence-jdbc/src/main/java/org/apache/openjpa/persistence/jdbc/DiscriminatorStrategy.java
AU        openjpa-persistence-jdbc/src/main/java/org/apache/openjpa/persistence/jdbc/ContainerTable.java
AU        openjpa-persistence-jdbc/src/main/java/org/apache/openjpa/persistence/jdbc/ForeignKey.java
AU        openjpa-persistence-jdbc/src/main/java/org/apache/openjpa/persistence/jdbc/EagerFetchMode.java
AU        openjpa-persistence-jdbc/src/main/java/org/apache/openjpa/persistence/jdbc/JoinSyntax.java
AU        openjpa-persistence-jdbc/src/main/java/org/apache/openjpa/persistence/jdbc/ElementColumn.java
AU        openjpa-persistence-jdbc/src/main/java/org/apache/openjpa/persistence/jdbc/XMLPersistenceMappingSerializer.java
A         openjpa-persistence-jdbc/src/main/java/org/apache/openjpa/persistence/jdbc/package.html
AU        openjpa-persistence-jdbc/src/main/java/org/apache/openjpa/persistence/jdbc/MappingTag.java
AU        openjpa-persistence-jdbc/src/main/java/org/apache/openjpa/persistence/jdbc/PersistenceMappingDefaults.java
AU        openjpa-persistence-jdbc/src/main/java/org/apache/openjpa/persistence/jdbc/ClassCriteria.java
AU        openjpa-persistence-jdbc/src/main/java/org/apache/openjpa/persistence/jdbc/PersistenceMappingFactory.java
AU        openjpa-persistence-jdbc/src/main/java/org/apache/openjpa/persistence/jdbc/ElementColumns.java
AU        openjpa-persistence-jdbc/src/main/java/org/apache/openjpa/persistence/jdbc/ElementNonpolymorphic.java
AU        openjpa-persistence-jdbc/src/main/java/org/apache/openjpa/persistence/jdbc/MappingOverride.java
AU        openjpa-persistence-jdbc/src/main/java/org/apache/openjpa/persistence/jdbc/FetchMode.java
AU        openjpa-persistence-jdbc/src/main/java/org/apache/openjpa/persistence/jdbc/SubclassFetchMode.java
AU        openjpa-persistence-jdbc/src/main/java/org/apache/openjpa/persistence/jdbc/ForeignKeyAction.java
AU        openjpa-persistence-jdbc/src/main/java/org/apache/openjpa/persistence/jdbc/KeyClassCriteria.java
AU        openjpa-persistence-jdbc/src/main/java/org/apache/openjpa/persistence/jdbc/LRSSizeAlgorithm.java
AU        openjpa-persistence-jdbc/src/main/java/org/apache/openjpa/persistence/jdbc/EmbeddedMapping.java
AU        openjpa-persistence-jdbc/src/main/java/org/apache/openjpa/persistence/jdbc/VersionStrategy.java
AU        openjpa-persistence-jdbc/src/main/java/org/apache/openjpa/persistence/jdbc/AnnotationPersistenceMappingParser.java
AU        openjpa-persistence-jdbc/src/main/java/org/apache/openjpa/persistence/jdbc/JDBCFetchPlanImpl.java
AU        openjpa-persistence-jdbc/src/main/java/org/apache/openjpa/persistence/jdbc/KeyForeignKey.java
AU        openjpa-persistence-jdbc/src/main/java/org/apache/openjpa/persistence/jdbc/MappingOverrides.java
AU        openjpa-persistence-jdbc/src/main/java/org/apache/openjpa/persistence/jdbc/Nonpolymorphic.java
AU        openjpa-persistence-jdbc/src/main/java/org/apache/openjpa/persistence/jdbc/XMappingOverride.java
AU        openjpa-persistence-jdbc/src/main/java/org/apache/openjpa/persistence/jdbc/XSecondaryTable.java
AU        openjpa-persistence-jdbc/src/main/java/org/apache/openjpa/persistence/jdbc/ElementJoinColumn.java
AU        openjpa-persistence-jdbc/src/main/java/org/apache/openjpa/persistence/jdbc/JDBCFetchPlan.java
AU        openjpa-persistence-jdbc/src/main/java/org/apache/openjpa/persistence/jdbc/XJoinColumns.java
AU        openjpa-persistence-jdbc/src/main/java/org/apache/openjpa/persistence/jdbc/OrderColumn.java
AU        openjpa-persistence-jdbc/src/main/java/org/apache/openjpa/persistence/jdbc/KeyColumns.java
AU        openjpa-persistence-jdbc/src/main/java/org/apache/openjpa/persistence/jdbc/FetchDirection.java
AU        openjpa-persistence-jdbc/src/main/java/org/apache/openjpa/persistence/jdbc/ResultSetType.java
AU        openjpa-persistence-jdbc/src/main/java/org/apache/openjpa/persistence/jdbc/JDBCPersistenceProductDerivation.java
AU        openjpa-persistence-jdbc/src/main/java/org/apache/openjpa/persistence/jdbc/XEmbeddedMapping.java
AU        openjpa-persistence-jdbc/src/main/java/org/apache/openjpa/persistence/jdbc/ElementClassCriteria.java
AU        openjpa-persistence-jdbc/src/main/java/org/apache/openjpa/persistence/jdbc/XMappingOverrides.java
AU        openjpa-persistence-jdbc/src/main/java/org/apache/openjpa/persistence/jdbc/KeyColumn.java
AU        openjpa-persistence-jdbc/src/main/java/org/apache/openjpa/persistence/jdbc/Index.java
AU        openjpa-persistence-jdbc/src/main/java/org/apache/openjpa/persistence/jdbc/XSecondaryTables.java
AU        openjpa-persistence-jdbc/src/main/java/org/apache/openjpa/persistence/jdbc/ElementJoinColumns.java
AU        openjpa-persistence-jdbc/src/main/java/org/apache/openjpa/persistence/jdbc/KeyStrategy.java
AU        openjpa-persistence-jdbc/src/main/java/org/apache/openjpa/persistence/jdbc/ElementStrategy.java
AU        openjpa-persistence-jdbc/src/main/java/org/apache/openjpa/persistence/jdbc/ElementEmbeddedMapping.java
AU        openjpa-persistence-jdbc/src/main/java/org/apache/openjpa/persistence/jdbc/XTable.java
AU        openjpa-persistence-jdbc/src/main/java/org/apache/openjpa/persistence/jdbc/KeyIndex.java
AU        openjpa-persistence-jdbc/src/main/java/org/apache/openjpa/persistence/jdbc/NonpolymorphicType.java
AU        openjpa-persistence-jdbc/src/main/java/org/apache/openjpa/persistence/jdbc/AnnotationPersistenceMappingSerializer.java
AU        openjpa-persistence-jdbc/src/main/java/org/apache/openjpa/persistence/jdbc/KeyNonpolymorphic.java
AU        openjpa-persistence-jdbc/src/main/java/org/apache/openjpa/persistence/jdbc/IsolationLevel.java
AU        openjpa-persistence-jdbc/src/main/java/org/apache/openjpa/persistence/jdbc/XMLPersistenceMappingParser.java
A         openjpa-persistence-jdbc/src/main/ant
AU        openjpa-persistence-jdbc/src/main/ant/enhancer.xml
AU        openjpa-persistence-jdbc/pom.xml
AU        patchoj.py
 U        .
At revision 1802322

Setting ANT_1_9_7_HOME=/home/jenkins/tools/ant/apache-ant-1.9.7
Setting JDK_1_6_LATEST__HOME=/home/jenkins/tools/java/latest1.6
Setting MAVEN_2_2_1_HOME=/home/jenkins/tools/maven/apache-maven-2.2.1
[OpenJPA-2.2.x] $ /bin/bash -xe /tmp/jenkins4345718439903847577.sh
+ export ANT_HOME=/home/jenkins/tools/ant/apache-ant-1.9.7
+ ANT_HOME=/home/jenkins/tools/ant/apache-ant-1.9.7
+ export JAVA_HOME=/home/jenkins/tools/java/latest1.6
+ JAVA_HOME=/home/jenkins/tools/java/latest1.6
+ export M2_HOME=/home/jenkins/tools/maven/apache-maven-2.2.1
+ M2_HOME=/home/jenkins/tools/maven/apache-maven-2.2.1
+ cd 2.2.x
/tmp/jenkins4345718439903847577.sh: line 6: cd: 2.2.x: No such file or directory
Build step 'Execute shell' marked build as failure
Archiving artifacts
Setting ANT_1_9_7_HOME=/home/jenkins/tools/ant/apache-ant-1.9.7
Setting JDK_1_6_LATEST__HOME=/home/jenkins/tools/java/latest1.6
Setting MAVEN_2_2_1_HOME=/home/jenkins/tools/maven/apache-maven-2.2.1
Recording test results
Setting ANT_1_9_7_HOME=/home/jenkins/tools/ant/apache-ant-1.9.7
Setting JDK_1_6_LATEST__HOME=/home/jenkins/tools/java/latest1.6
Setting MAVEN_2_2_1_HOME=/home/jenkins/tools/maven/apache-maven-2.2.1
ERROR: Step ?Publish JUnit test result report? failed: No test report files were found. Configuration error?
Setting ANT_1_9_7_HOME=/home/jenkins/tools/ant/apache-ant-1.9.7
Setting JDK_1_6_LATEST__HOME=/home/jenkins/tools/java/latest1.6
Setting MAVEN_2_2_1_HOME=/home/jenkins/tools/maven/apache-maven-2.2.1
Reply | Threaded
Open this post in threaded view
|  
Report Content as Inappropriate

Build failed in Jenkins: OpenJPA-2.2.x #2

Apache Jenkins Server-2
See <https://builds.apache.org/job/OpenJPA-2.2.x/2/display/redirect>

------------------------------------------
Started by user jgrassel
[EnvInject] - Loading node environment variables.
Building remotely on H26 (ubuntu xenial) in workspace <https://builds.apache.org/job/OpenJPA-2.2.x/ws/>
Updating https://svn.apache.org/repos/asf/openjpa/branches/2.2.x at revision '2017-07-18T18:30:50.150 +0000'
At revision 1802322

No changes for https://svn.apache.org/repos/asf/openjpa/branches/2.2.x since the previous build
Setting ANT_1_9_7_HOME=/home/jenkins/tools/ant/apache-ant-1.9.7
Setting JDK_1_6_LATEST__HOME=/home/jenkins/tools/java/latest1.6
Setting MAVEN_2_2_1_HOME=/home/jenkins/tools/maven/apache-maven-2.2.1
[OpenJPA-2.2.x] $ /bin/bash -xe /tmp/jenkins6181337743173138663.sh
+ export ANT_HOME=/home/jenkins/tools/ant/apache-ant-1.9.7
+ ANT_HOME=/home/jenkins/tools/ant/apache-ant-1.9.7
+ export JAVA_HOME=/home/jenkins/tools/java/latest1.6
+ JAVA_HOME=/home/jenkins/tools/java/latest1.6
+ export M2_HOME=/home/jenkins/tools/maven/apache-maven-2.2.1
+ M2_HOME=/home/jenkins/tools/maven/apache-maven-2.2.1
+ export PATH=/home/jenkins/tools/ant/apache-ant-1.9.7/bin:/home/jenkins/tools/java/latest1.6/bin:/home/jenkins/tools/maven/apache-maven-2.2.1/bin
+ PATH=/home/jenkins/tools/ant/apache-ant-1.9.7/bin:/home/jenkins/tools/java/latest1.6/bin:/home/jenkins/tools/maven/apache-maven-2.2.1/bin
+ cd 2.2.x
/tmp/jenkins6181337743173138663.sh: line 8: cd: 2.2.x: No such file or directory
Build step 'Execute shell' marked build as failure
Archiving artifacts
Setting ANT_1_9_7_HOME=/home/jenkins/tools/ant/apache-ant-1.9.7
Setting JDK_1_6_LATEST__HOME=/home/jenkins/tools/java/latest1.6
Setting MAVEN_2_2_1_HOME=/home/jenkins/tools/maven/apache-maven-2.2.1
Recording test results
Setting ANT_1_9_7_HOME=/home/jenkins/tools/ant/apache-ant-1.9.7
Setting JDK_1_6_LATEST__HOME=/home/jenkins/tools/java/latest1.6
Setting MAVEN_2_2_1_HOME=/home/jenkins/tools/maven/apache-maven-2.2.1
ERROR: Step ?Publish JUnit test result report? failed: No test report files were found. Configuration error?
Setting ANT_1_9_7_HOME=/home/jenkins/tools/ant/apache-ant-1.9.7
Setting JDK_1_6_LATEST__HOME=/home/jenkins/tools/java/latest1.6
Setting MAVEN_2_2_1_HOME=/home/jenkins/tools/maven/apache-maven-2.2.1
Reply | Threaded
Open this post in threaded view
|  
Report Content as Inappropriate

Build failed in Jenkins: OpenJPA-2.2.x #3

Apache Jenkins Server-2
See <https://builds.apache.org/job/OpenJPA-2.2.x/3/display/redirect>

------------------------------------------
Started by user jgrassel
[EnvInject] - Loading node environment variables.
Building remotely on H26 (ubuntu xenial) in workspace <https://builds.apache.org/job/OpenJPA-2.2.x/ws/>
Updating https://svn.apache.org/repos/asf/openjpa/branches/2.2.x at revision '2017-07-18T18:33:52.844 +0000'
At revision 1802322

No changes for https://svn.apache.org/repos/asf/openjpa/branches/2.2.x since the previous build
Setting ANT_1_9_7_HOME=/home/jenkins/tools/ant/apache-ant-1.9.7
Setting JDK_1_6_LATEST__HOME=/home/jenkins/tools/java/latest1.6
Setting MAVEN_2_2_1_HOME=/home/jenkins/tools/maven/apache-maven-2.2.1
[OpenJPA-2.2.x] $ /bin/bash -xe /tmp/jenkins6734060260954428731.sh
+ export ANT_HOME=/home/jenkins/tools/ant/apache-ant-1.9.7
+ ANT_HOME=/home/jenkins/tools/ant/apache-ant-1.9.7
+ export JAVA_HOME=/home/jenkins/tools/java/latest1.6
+ JAVA_HOME=/home/jenkins/tools/java/latest1.6
+ export M2_HOME=/home/jenkins/tools/maven/apache-maven-2.2.1
+ M2_HOME=/home/jenkins/tools/maven/apache-maven-2.2.1
+ export PATH=/home/jenkins/tools/ant/apache-ant-1.9.7/bin:/home/jenkins/tools/java/latest1.6/bin:/home/jenkins/tools/maven/apache-maven-2.2.1/bin
+ PATH=/home/jenkins/tools/ant/apache-ant-1.9.7/bin:/home/jenkins/tools/java/latest1.6/bin:/home/jenkins/tools/maven/apache-maven-2.2.1/bin
+ mvn clean install
/home/jenkins/tools/maven/apache-maven-2.2.1/bin/mvn: 1: /home/jenkins/tools/maven/apache-maven-2.2.1/bin/mvn: uname: not found
Error getting environment vars for profile activation: java.io.IOException: Cannot run program "env": java.io.IOException: error=2, No such file or directory
[WARNING] Failed to initialize environment variable resolver. Skipping environment substitution in settings.
[WARNING] Failed to initialize environment variable resolver. Skipping environment substitution in settings.
[INFO] Scanning for projects...
[INFO] Reactor build order:
[INFO]   OpenJPA Parent POM
[INFO]   OpenJPA Utilities Library
[INFO]   OpenJPA Kernel
[INFO]   OpenJPA JDBC
[INFO]   OpenJPA Persistence
[INFO]   OpenJPA Persistence JDBC
[INFO]   OpenJPA Persistence Locking Tests
[INFO]   OpenJPA tools
[INFO]   OpenJPA Maven Plugin
[INFO]   OpenJPA XML Store
[INFO]   OpenJPA Slice
[INFO]   OpenJPA JEST
[INFO]   OpenJPA Aggregate Jar
[INFO]   OpenJPA Aggregate Jar with Dependencies
[INFO]   OpenJPA Project Docs and Assemblies
[INFO]   OpenJPA Examples
[INFO]   OpenJPA Examples - Simple
[INFO]   OpenJPA Examples - image-gallery
[INFO]   OpenJPA Examples - OpenBooks
[INFO]   OpenJPA Integration Tests
[INFO]   OpenJPA Integration Tests - Daytrader
[INFO]   OpenJPA Integration Tests - Examples
[INFO]   OpenJPA Integration Tests - SLF4JLogFactory
[INFO]   OpenJPA Integration Tests - JPA TCK
[INFO]   OpenJPA Integration Tests - Bean Validation
[INFO]   OpenJPA Integration Tests - JMX Platform MBeans
Downloading: http://repo1.maven.org/maven2/org/apache/felix/maven-bundle-plugin/2.2.0/maven-bundle-plugin-2.2.0.pom
4/4K4/4K4K downloaded  (maven-bundle-plugin-2.2.0.pom)
Downloading: http://repo1.maven.org/maven2/org/apache/felix/maven-bundle-plugin/2.2.0/maven-bundle-plugin-2.2.0.jar
4/113K8/113K12/113K13/113K17/113K21/113K25/113K29/113K33/113K37/113K41/113K45/113K49/113K53/113K57/113K61/113K65/113K69/113K73/113K77/113K81/113K85/113K89/113K93/113K97/113K101/113K105/113K109/113K113/113K113/113K113K downloaded  (maven-bundle-plugin-2.2.0.jar)
[WARNING] POM for 'biz.aQute:bndlib:pom:1.15.0:runtime' is invalid.

Its dependencies (if any) will NOT be available to the current build.
[INFO] ------------------------------------------------------------------------
[INFO] Building OpenJPA Parent POM
[INFO]    task-segment: [clean, install]
[INFO] ------------------------------------------------------------------------
Downloading: http://repo1.maven.org/maven2/org/apache/maven/plugins/maven-clean-plugin/2.3/maven-clean-plugin-2.3.pom
4/4K4/4K4K downloaded  (maven-clean-plugin-2.3.pom)
Downloading: http://repo1.maven.org/maven2/org/apache/maven/plugins/maven-clean-plugin/2.3/maven-clean-plugin-2.3.jar
4/16K8/16K12/16K16/16K16/16K16K downloaded  (maven-clean-plugin-2.3.jar)
Downloading: http://repo1.maven.org/maven2/org/apache/maven/plugins/maven-remote-resources-plugin/1.1/maven-remote-resources-plugin-1.1.pom
4/11K8/11K11/11K11K downloaded  (maven-remote-resources-plugin-1.1.pom)
Downloading: http://repo1.maven.org/maven2/org/apache/maven/plugins/maven-plugins/14/maven-plugins-14.pom
4/12K8/12K12/12K12/12K12K downloaded  (maven-plugins-14.pom)
Downloading: http://repo1.maven.org/maven2/org/apache/maven/plugins/maven-remote-resources-plugin/1.1/maven-remote-resources-plugin-1.1.jar
4/60K8/60K12/60K16/60K20/60K24/60K28/60K32/60K36/60K40/60K44/60K48/60K52/60K56/60K60/60K60/60K60K downloaded  (maven-remote-resources-plugin-1.1.jar)
Downloading: http://repo1.maven.org/maven2/org/apache/maven/plugins/maven-compiler-plugin/2.3.2/maven-compiler-plugin-2.3.2.pom
4/7K7/7K7K downloaded  (maven-compiler-plugin-2.3.2.pom)
Downloading: http://repo1.maven.org/maven2/org/apache/maven/plugins/maven-compiler-plugin/2.3.2/maven-compiler-plugin-2.3.2.jar
4/28K8/28K12/28K16/28K20/28K24/28K28/28K28/28K28K downloaded  (maven-compiler-plugin-2.3.2.jar)
Downloading: http://repo1.maven.org/maven2/org/codehaus/mojo/ianal-maven-plugin/1.0-alpha-1/ianal-maven-plugin-1.0-alpha-1.pom
4/17K8/17K12/17K16/17K17/17K17K downloaded  (ianal-maven-plugin-1.0-alpha-1.pom)
Downloading: http://repo1.maven.org/maven2/org/codehaus/mojo/mojo/15/mojo-15.pom
4/8K8/8K8/8K8K downloaded  (mojo-15.pom)
Downloading: http://repo1.maven.org/maven2/org/codehaus/mojo/ianal-maven-plugin/1.0-alpha-1/ianal-maven-plugin-1.0-alpha-1.jar
4/23K8/23K12/23K16/23K20/23K23/23K23K downloaded  (ianal-maven-plugin-1.0-alpha-1.jar)
Downloading: http://repo1.maven.org/maven2/org/codehaus/mojo/buildnumber-maven-plugin/1.0-beta-4/buildnumber-maven-plugin-1.0-beta-4.pom
4/9K8/9K9/9K9K downloaded  (buildnumber-maven-plugin-1.0-beta-4.pom)
Downloading: http://repo1.maven.org/maven2/org/codehaus/mojo/buildnumber-maven-plugin/1.0-beta-4/buildnumber-maven-plugin-1.0-beta-4.jar
4/21K8/21K12/21K16/21K20/21K21/21K21K downloaded  (buildnumber-maven-plugin-1.0-beta-4.jar)
Downloading: http://repo1.maven.org/maven2/org/apache/maven/plugins/maven-checkstyle-plugin/2.9/maven-checkstyle-plugin-2.9.pom
4/9K8/9K9/9K9K downloaded  (maven-checkstyle-plugin-2.9.pom)
Downloading: http://repo1.maven.org/maven2/org/apache/maven/plugins/maven-checkstyle-plugin/2.9/maven-checkstyle-plugin-2.9.jar
4/84K8/84K12/84K16/84K20/84K24/84K28/84K32/84K36/84K40/84K44/84K48/84K52/84K56/84K60/84K64/84K68/84K72/84K76/84K80/84K84/84K84/84K84K downloaded  (maven-checkstyle-plugin-2.9.jar)
[INFO] [clean:clean {execution: default-clean}]
Downloading: http://repo1.maven.org/maven2/org/apache/maven/scm/maven-scm-api/1.2/maven-scm-api-1.2.pom
1/1K1K downloaded  (maven-scm-api-1.2.pom)
Downloading: http://repo1.maven.org/maven2/org/apache/maven/scm/maven-scm/1.2/maven-scm-1.2.pom
4/11K8/11K11/11K11K downloaded  (maven-scm-1.2.pom)
Downloading: http://repo1.maven.org/maven2/org/apache/maven/scm/maven-scm-manager-plexus/1.2/maven-scm-manager-plexus-1.2.pom
2/2K2K downloaded  (maven-scm-manager-plexus-1.2.pom)
Downloading: http://repo1.maven.org/maven2/org/apache/maven/scm/maven-scm-managers/1.2/maven-scm-managers-1.2.pom
1/1K1K downloaded  (maven-scm-managers-1.2.pom)
Downloading: http://repo1.maven.org/maven2/org/apache/maven/scm/maven-scm-provider-svnexe/1.2/maven-scm-provider-svnexe-1.2.pom
2/2K2K downloaded  (maven-scm-provider-svnexe-1.2.pom)
Downloading: http://repo1.maven.org/maven2/org/apache/maven/scm/maven-scm-providers-svn/1.2/maven-scm-providers-svn-1.2.pom
1/1K1K downloaded  (maven-scm-providers-svn-1.2.pom)
Downloading: http://repo1.maven.org/maven2/org/apache/maven/scm/maven-scm-providers/1.2/maven-scm-providers-1.2.pom
3/3K3K downloaded  (maven-scm-providers-1.2.pom)
Downloading: http://repo1.maven.org/maven2/org/apache/maven/scm/maven-scm-provider-svn-commons/1.2/maven-scm-provider-svn-commons-1.2.pom
1/1K1K downloaded  (maven-scm-provider-svn-commons-1.2.pom)
Downloading: http://repo1.maven.org/maven2/org/apache/maven/scm/maven-scm-provider-cvsexe/1.2/maven-scm-provider-cvsexe-1.2.pom
2/2K2K downloaded  (maven-scm-provider-cvsexe-1.2.pom)
Downloading: http://repo1.maven.org/maven2/org/apache/maven/scm/maven-scm-providers-cvs/1.2/maven-scm-providers-cvs-1.2.pom
1/1K1K downloaded  (maven-scm-providers-cvs-1.2.pom)
Downloading: http://repo1.maven.org/maven2/org/apache/maven/scm/maven-scm-provider-cvs-commons/1.2/maven-scm-provider-cvs-commons-1.2.pom
2/2K2K downloaded  (maven-scm-provider-cvs-commons-1.2.pom)
Downloading: http://repo1.maven.org/maven2/org/apache/maven/scm/maven-scm-provider-starteam/1.2/maven-scm-provider-starteam-1.2.pom
2/2K2K downloaded  (maven-scm-provider-starteam-1.2.pom)
Downloading: http://repo1.maven.org/maven2/org/apache/maven/scm/maven-scm-provider-clearcase/1.2/maven-scm-provider-clearcase-1.2.pom
2/2K2K downloaded  (maven-scm-provider-clearcase-1.2.pom)
Downloading: http://repo1.maven.org/maven2/org/apache/maven/scm/maven-scm-provider-perforce/1.2/maven-scm-provider-perforce-1.2.pom
2/2K2K downloaded  (maven-scm-provider-perforce-1.2.pom)
Downloading: http://repo1.maven.org/maven2/org/apache/maven/scm/maven-scm-provider-hg/1.2/maven-scm-provider-hg-1.2.pom
2/2K2K downloaded  (maven-scm-provider-hg-1.2.pom)
Downloading: http://repo1.maven.org/maven2/com/google/code/maven-scm-provider-svnjava/maven-scm-provider-svnjava/1.8/maven-scm-provider-svnjava-1.8.pom
4/7K7/7K7K downloaded  (maven-scm-provider-svnjava-1.8.pom)
Downloading: http://repo1.maven.org/maven2/org/tmatesoft/svnkit/svnkit/1.3.1-1/svnkit-1.3.1-1.pom
1/1K1K downloaded  (svnkit-1.3.1-1.pom)
Downloading: http://repo1.maven.org/maven2/com/trilead/trilead-ssh2/build213-svnkit-1.3-patch/trilead-ssh2-build213-svnkit-1.3-patch.pom
716/716b716b downloaded  (trilead-ssh2-build213-svnkit-1.3-patch.pom)
Downloading: http://repo1.maven.org/maven2/org/tmatesoft/sqljet/sqljet/1.0.0-1/sqljet-1.0.0-1.pom
774/774b774b downloaded  (sqljet-1.0.0-1.pom)
Downloading: http://repo1.maven.org/maven2/org/tmatesoft/svnkit/svnkit/1.3.1-1/svnkit-1.3.1-1.jar
Downloading: http://repo1.maven.org/maven2/org/apache/maven/scm/maven-scm-api/1.2/maven-scm-api-1.2.jar
Downloading: http://repo1.maven.org/maven2/org/tmatesoft/sqljet/sqljet/1.0.0-1/sqljet-1.0.0-1.jar
Downloading: http://repo1.maven.org/maven2/com/google/code/maven-scm-provider-svnjava/maven-scm-provider-svnjava/1.8/maven-scm-provider-svnjava-1.8.jar
Downloading: http://repo1.maven.org/maven2/com/trilead/trilead-ssh2/build213-svnkit-1.3-patch/trilead-ssh2-build213-svnkit-1.3-patch.jar
4/43K8/43K8/43K 4/82K12/43K 4/82K13/43K 4/82K13/43K 8/82K13/43K 8/82K 4/245K13/43K 12/82K 4/245K13/43K 12/82K 8/245K13/43K 12/82K 12/245K13/43K 13/82K 12/245K17/43K 13/82K 12/245K17/43K 13/82K 13/245K21/43K 13/82K 13/245K25/43K 13/82K 13/245K25/43K 17/82K 13/245K25/43K 17/82K 13/245K 4/656K29/43K 17/82K 13/245K 4/656K29/43K 21/82K 13/245K 4/656K29/43K 21/82K 17/245K 4/656K29/43K 21/82K 17/245K 8/656K33/43K 21/82K 17/245K 8/656K33/43K 25/82K 17/245K 8/656K33/43K 25/82K 21/245K 8/656K33/43K 25/82K 21/245K 12/656K33/43K 25/82K 25/245K 12/656K37/43K 25/82K 25/245K 12/656K37/43K 29/82K 25/245K 12/656K37/43K 29/82K 25/245K 13/656K37/43K 29/82K 29/245K 13/656K41/43K 29/82K 29/245K 13/656K41/43K 33/82K 29/245K 13/656K41/43K 33/82K 33/245K 13/656K43/43K 33/82K 33/245K 13/656K43/43K 33/82K 37/245K 13/656K43K downloaded  (maven-scm-provider-svnjava-1.8.jar)
37/82K 37/245K 13/656K37/82K 37/245K 17/656K37/82K 41/245K 17/656K37/82K 41/245K 21/656K41/82K 41/245K 21/656K41/82K 41/245K 21/656K41/82K 45/245K 21/656K41/82K 45/245K 25/656K45/82K 45/245K 25/656K45/82K 49/245K 25/656K45/82K 49/245K 29/656K45/82K 53/245K 29/656K45/82K 53/245K 33/656K49/82K 53/245K 33/656K49/82K 57/245K 33/656K49/82K 57/245K 37/656K53/82K 57/245K 37/656K53/82K 61/245K 37/656K53/82K 61/245K 41/656K57/82K 61/245K 41/656K57/82K 65/245K 41/656K57/82K 65/245K 45/656K57/82K 65/245K 45/656K 4/1882K57/82K 69/245K 45/656K 4/1882K57/82K 69/245K 49/656K 4/1882K61/82K 69/245K 49/656K 4/1882K61/82K 69/245K 49/656K 8/1882K61/82K 73/245K 49/656K 8/1882K61/82K 73/245K 53/656K 8/1882K65/82K 73/245K 53/656K 8/1882K65/82K 77/245K 53/656K 8/1882K65/82K 77/245K 53/656K 12/1882K65/82K 77/245K 57/656K 12/1882K65/82K 81/245K 57/656K 12/1882K69/82K 81/245K 57/656K 12/1882K69/82K 81/245K 61/656K 12/1882K69/82K 81/245K 61/656K 16/1882K69/82K 85/245K 61/656K 16/1882K73/82K 85/245K 61/656K 16/1882K73/82K 85/245K 65/656K 16/1882K73/82K 89/245K 65/656K 16/1882K73/82K 89/245K 65/656K 20/1882K73/82K 89/245K 69/656K 20/1882K73/82K 93/245K 69/656K 20/1882K77/82K 93/245K 69/656K 20/1882K77/82K 93/245K 73/656K 20/1882K77/82K 93/245K 73/656K 24/1882K77/82K 97/245K 73/656K 24/1882K81/82K 97/245K 73/656K 24/1882K81/82K 97/245K 77/656K 24/1882K81/82K 101/245K 77/656K 24/1882K81/82K 101/245K 77/656K 28/1882K81/82K 101/245K 81/656K 28/1882K82/82K 101/245K 81/656K 28/1882K82/82K 105/245K 81/656K 28/1882K82K downloaded  (maven-scm-api-1.2.jar)
105/245K 81/656K 32/1882K105/245K 85/656K 32/1882K109/245K 85/656K 32/1882K109/245K 89/656K 32/1882K113/245K 89/656K 32/1882K113/245K 89/656K 36/1882K113/245K 93/656K 36/1882K117/245K 93/656K 36/1882K117/245K 93/656K 40/1882K117/245K 97/656K 40/1882K121/245K 97/656K 40/1882K121/245K 101/656K 40/1882K121/245K 101/656K 44/1882K125/245K 101/656K 44/1882K125/245K 105/656K 44/1882K129/245K 105/656K 44/1882K129/245K 105/656K 48/1882K129/245K 109/656K 48/1882K133/245K 109/656K 48/1882K133/245K 113/656K 48/1882K133/245K 113/656K 52/1882K137/245K 113/656K 52/1882K137/245K 117/656K 52/1882K141/245K 117/656K 52/1882K141/245K 117/656K 56/1882K141/245K 121/656K 56/1882K145/245K 121/656K 56/1882K145/245K 121/656K 60/1882K145/245K 125/656K 60/1882K149/245K 125/656K 60/1882KDownloading: http://repo1.maven.org/maven2/org/apache/maven/scm/maven-scm-manager-plexus/1.2/maven-scm-manager-plexus-1.2.jar
149/245K 129/656K 60/1882K153/245K 129/656K 60/1882K153/245K 129/656K 64/1882K153/245K 133/656K 64/1882K157/245K 133/656K 64/1882K157/245K 133/656K 68/1882K157/245K 137/656K 68/1882K161/245K 137/656K 68/1882K161/245K 141/656K 68/1882K165/245K 141/656K 68/1882K165/245K 141/656K 72/1882K165/245K 145/656K 72/1882K169/245K 145/656K 72/1882K169/245K 145/656K 76/1882K169/245K 149/656K 76/1882K173/245K 149/656K 76/1882K173/245K 149/656K 80/1882K173/245K 153/656K 80/1882K177/245K 153/656K 80/1882K177/245K 157/656K 80/1882K181/245K 157/656K 80/1882K181/245K 157/656K 84/1882K181/245K 161/656K 84/1882K185/245K 161/656K 84/1882K185/245K 161/656K 88/1882K185/245K 165/656K 88/1882K189/245K 165/656K 88/1882K189/245K 165/656K 88/1882K 4/10K189/245K 169/656K 88/1882K 4/10K193/245K 169/656K 88/1882K 4/10K193/245K 169/656K 92/1882K 4/10K193/245K 169/656K 92/1882K 8/10K193/245K 173/656K 92/1882K 8/10K197/245K 173/656K 92/1882K 8/10K197/245K 173/656K 96/1882K 8/10K197/245K 177/656K 96/1882K 8/10K201/245K 177/656K 96/1882K 8/10K201/245K 177/656K 96/1882K 10/10K201/245K 177/656K 100/1882K 10/10K201/245K 181/656K 100/1882K 10/10K10K downloaded  (maven-scm-manager-plexus-1.2.jar)
205/245K 181/656K 100/1882K205/245K 185/656K 100/1882K205/245K 185/656K 104/1882K209/245K 185/656K 104/1882K209/245K 189/656K 104/1882K213/245K 189/656K 104/1882K213/245K 189/656K 108/1882K213/245K 193/656K 108/1882K217/245K 193/656K 108/1882K217/245K 197/656K 108/1882K217/245K 197/656K 112/1882K221/245K 197/656K 112/1882K221/245K 201/656K 112/1882K225/245K 201/656K 112/1882K225/245K 201/656K 116/1882K225/245K 205/656K 116/1882K229/245K 205/656K 116/1882K229/245K 209/656K 116/1882K229/245K 209/656K 120/1882K233/245K 209/656K 120/1882K233/245K 213/656K 120/1882K237/245K 213/656K 120/1882K237/245K 213/656K 124/1882K237/245K 217/656K 124/1882K241/245K 217/656K 124/1882K241/245K 221/656K 124/1882K241/245K 221/656K 128/1882K245/245K 221/656K 128/1882K245/245K 225/656K 128/1882K245K downloaded  (trilead-ssh2-build213-svnkit-1.3-patch.jar)
225/656K 132/1882K229/656K 132/1882K233/656K 132/1882K233/656K 136/1882K237/656K 136/1882K237/656K 140/1882K241/656K 140/1882K241/656K 144/1882K245/656K 144/1882K249/656K 144/1882K249/656K 148/1882K253/656K 148/1882K253/656K 152/1882K257/656K 152/1882K257/656K 156/1882K261/656K 156/1882K265/656K 156/1882K265/656K 160/1882K269/656K 160/1882K269/656K 164/1882K273/656K 164/1882K273/656K 168/1882K277/656K 168/1882K281/656K 168/1882K281/656K 172/1882K285/656K 172/1882K285/656K 176/1882K289/656K 176/1882K289/656K 180/1882K293/656K 180/1882KDownloading: http://repo1.maven.org/maven2/org/apache/maven/scm/maven-scm-provider-svnexe/1.2/maven-scm-provider-svnexe-1.2.jar
293/656K 184/1882K297/656K 184/1882K297/656K 188/1882K301/656K 188/1882K301/656K 192/1882K305/656K 192/1882K305/656K 196/1882K309/656K 196/1882K309/656K 200/1882K313/656K 200/1882K313/656K 204/1882K317/656K 204/1882K317/656K 208/1882K321/656K 208/1882K321/656K 212/1882K325/656K 212/1882K325/656K 216/1882K329/656K 216/1882K329/656K 220/1882K333/656K 220/1882K333/656K 224/1882K337/656K 224/1882K337/656K 228/1882K341/656K 228/1882K341/656K 232/1882K345/656K 232/1882K345/656K 236/1882K349/656K 236/1882K349/656K 240/1882K353/656K 240/1882K353/656K 244/1882K357/656K 244/1882K357/656K 248/1882K361/656K 248/1882K361/656K 252/1882K365/656K 252/1882K365/656K 256/1882K369/656K 256/1882K369/656K 260/1882K373/656K 260/1882K373/656K 264/1882K377/656K 264/1882K377/656K 268/1882K381/656K 268/1882K381/656K 272/1882K385/656K 272/1882K385/656K 276/1882K389/656K 276/1882K389/656K 280/1882K393/656K 280/1882K393/656K 284/1882K397/656K 284/1882K397/656K 288/1882K401/656K 288/1882K401/656K 292/1882K405/656K 292/1882K405/656K 296/1882K409/656K 296/1882K409/656K 300/1882K413/656K 300/1882K413/656K 304/1882K417/656K 304/1882K417/656K 308/1882K421/656K 308/1882K421/656K 312/1882K425/656K 312/1882K425/656K 316/1882K429/656K 316/1882K429/656K 320/1882K433/656K 320/1882K433/656K 324/1882K437/656K 324/1882K437/656K 328/1882K441/656K 328/1882K441/656K 332/1882K445/656K 332/1882K445/656K 336/1882K449/656K 336/1882K449/656K 340/1882K453/656K 340/1882K453/656K 344/1882K457/656K 344/1882K457/656K 348/1882K461/656K 348/1882K461/656K 352/1882K465/656K 352/1882K465/656K 356/1882K469/656K 356/1882K469/656K 360/1882K473/656K 360/1882K473/656K 364/1882K477/656K 364/1882K477/656K 368/1882K481/656K 368/1882K481/656K 372/1882K485/656K 372/1882K485/656K 376/1882K489/656K 376/1882K489/656K 380/1882K493/656K 380/1882K493/656K 384/1882K497/656K 384/1882K497/656K 388/1882K501/656K 388/1882K501/656K 392/1882K505/656K 392/1882K505/656K 396/1882K509/656K 396/1882K509/656K 396/1882K 4/58K509/656K 400/1882K 4/58K513/656K 400/1882K 4/58K513/656K 404/1882K 4/58K517/656K 404/1882K 4/58K517/656K 408/1882K 4/58K517/656K 408/1882K 8/58K521/656K 408/1882K 8/58K521/656K 412/1882K 8/58K521/656K 412/1882K 12/58K525/656K 412/1882K 12/58K525/656K 416/1882K 12/58K525/656K 416/1882K 16/58K529/656K 416/1882K 16/58K529/656K 420/1882K 16/58K529/656K 420/1882K 20/58K533/656K 420/1882K 20/58K533/656K 424/1882K 20/58K533/656K 424/1882K 24/58K537/656K 424/1882K 24/58K537/656K 428/1882K 24/58K537/656K 428/1882K 24/58K541/656K 428/1882K 24/58K541/656K 432/1882K 24/58K545/656K 432/1882K 24/58K545/656K 436/1882K 24/58K545/656K 436/1882K 28/58K549/656K 436/1882K 28/58K549/656K 440/1882K 28/58K549/656K 440/1882K 32/58K553/656K 440/1882K 32/58K553/656K 444/1882K 32/58K553/656K 444/1882K 36/58K557/656K 444/1882K 36/58K557/656K 448/1882K 36/58K557/656K 448/1882K 37/58K561/656K 448/1882K 37/58K561/656K 452/1882K 37/58K565/656K 452/1882K 37/58K565/656K 456/1882K 37/58K569/656K 456/1882K 37/58K569/656K 460/1882K 37/58K573/656K 460/1882K 37/58K573/656K 464/1882K 37/58K573/656K 464/1882K 41/58K577/656K 464/1882K 41/58K577/656K 468/1882K 41/58K577/656K 468/1882K 45/58K581/656K 468/1882K 45/58K581/656K 472/1882K 45/58K581/656K 472/1882K 49/58K581/656K 476/1882K 49/58K585/656K 476/1882K 49/58K585/656K 476/1882K 50/58K585/656K 480/1882K 50/58K589/656K 480/1882K 50/58K589/656K 484/1882K 50/58K593/656K 484/1882K 50/58K593/656K 488/1882K 50/58K597/656K 488/1882K 50/58K597/656K 492/1882K 50/58K601/656K 492/1882K 50/58K601/656K 496/1882K 50/58K601/656K 496/1882K 54/58K605/656K 496/1882K 54/58K605/656K 500/1882K 54/58K605/656K 500/1882K 57/58K609/656K 500/1882K 57/58K609/656K 504/1882K 57/58K613/656K 504/1882K 57/58K613/656K 508/1882K 57/58K617/656K 508/1882K 57/58K617/656K 512/1882K 57/58K621/656K 512/1882K 57/58K621/656K 516/1882K 57/58K625/656K 516/1882K 57/58K625/656K 520/1882K 57/58K629/656K 520/1882K 57/58K629/656K 524/1882K 57/58K633/656K 524/1882K 57/58K633/656K 528/1882K 57/58K637/656K 528/1882K 57/58K637/656K 532/1882K 57/58K641/656K 532/1882K 57/58K641/656K 536/1882K 57/58K641/656K 536/1882K 58/58K645/656K 536/1882K 58/58K58K downloaded  (maven-scm-provider-svnexe-1.2.jar)
645/656K 540/1882K649/656K 540/1882K649/656K 544/1882K653/656K 544/1882K653/656K 548/1882K656/656K 548/1882K656/656K 552/1882K656K downloaded  (sqljet-1.0.0-1.jar)
556/1882K560/1882K564/1882K568/1882K572/1882K576/1882K580/1882K584/1882K588/1882K592/1882K596/1882K600/1882K604/1882K608/1882K612/1882K616/1882K620/1882K624/1882K628/1882K632/1882K636/1882K640/1882K644/1882K648/1882K652/1882K656/1882K660/1882K664/1882K668/1882K672/1882K676/1882K680/1882K684/1882K688/1882K692/1882K696/1882K700/1882K704/1882K708/1882K712/1882K716/1882K720/1882K724/1882K726/1882K730/1882K734/1882K738/1882K742/1882K744/1882K748/1882K752/1882K756/1882K760/1882K764/1882K768/1882K772/1882K772/1882KDownloading: http://repo1.maven.org/maven2/org/apache/maven/scm/maven-scm-provider-svn-commons/1.2/maven-scm-provider-svn-commons-1.2.jar
776/1882K780/1882K784/1882K788/1882K792/1882K796/1882K800/1882K804/1882K808/1882K812/1882K816/1882K820/1882K824/1882K828/1882K832/1882K836/1882K840/1882K844/1882K848/1882K852/1882K856/1882K860/1882K864/1882K868/1882K871/1882K875/1882K879/1882K883/1882K887/1882K891/1882K895/1882K897/1882K901/1882K905/1882K909/1882K913/1882K917/1882K921/1882K925/1882K927/1882K931/1882K935/1882K935/1882K939/1882K943/1882K947/1882K951/1882K955/1882K959/1882K963/1882K967/1882K971/1882K975/1882K979/1882K983/1882K987/1882K991/1882K993/1882K997/1882K999/1882K1003/1882K1007/1882K1011/1882K1015/1882K1019/1882K1023/1882K1027/1882K1031/1882K1031/1882K1035/1882K1039/1882K1043/1882K1047/1882K1051/1882K1055/1882K1059/1882K1063/1882K1067/1882K1071/1882K1075/1882K1079/1882K1083/1882K1087/1882K1091/1882K1095/1882K1099/1882K1103/1882K1107/1882K1111/1882K1113/1882K1117/1882K1121/1882K1125/1882K1126/1882K1130/1882K1134/1882K1138/1882K1142/1882K1146/1882K1150/1882K1154/1882K1158/1882K1158/1882K1162/1882K1166/1882K1170/1882K1174/1882K1178/1882K1182/1882K1186/1882K1190/1882K1194/1882K1198/1882K1202/1882K1206/1882K1210/1882K1214/1882K1218/1882K1222/1882K1222/1882K1226/1882K1230/1882K1234/1882K1238/1882K1242/1882K1246/1882K1250/1882K1254/1882K1258/1882K1262/1882K1266/1882K1270/1882K1274/1882K1278/1882K1282/1882K1286/1882K1290/1882K1294/1882K1298/1882K1302/1882K1306/1882K1310/1882K1314/1882K1317/1882K1321/1882K1325/1882K1329/1882K1333/1882K1337/1882K1341/1882K1345/1882K1349/1882K1352/1882K1356/1882K1360/1882K1364/1882K1368/1882K1372/1882K1376/1882K1380/1882K1384/1882K1388/1882K1392/1882K1396/1882K1400/1882K1404/1882K1408/1882K1412/1882K1416/1882K1417/1882K1421/1882K1425/1882K1429/1882K1433/1882K1437/1882K1441/1882K1444/1882K1448/1882K1452/1882K1456/1882K1460/1882K1464/1882K1468/1882K1472/1882K1476/1882K1480/1882K1482/1882K1486/1882K1490/1882K1494/1882K1498/1882K1502/1882K1506/1882K1510/1882K1514/1882K1518/1882K1522/1882K1526/1882K1530/1882K1534/1882K1538/1882K1542/1882K1546/1882K1550/1882K1554/1882K1558/1882K1562/1882K1566/1882K1570/1882K1571/1882K1575/1882K1579/1882K1583/1882K1587/1882K1591/1882K1595/1882K1599/1882K1603/1882K1607/1882K1611/1882K1615/1882K1619/1882K1623/1882K1627/1882K1631/1882K1635/1882K1639/1882K1643/1882K1647/1882K1651/1882K1655/1882K1659/1882K1663/1882K1667/1882K1671/1882K1675/1882K1679/1882K1683/1882K1687/1882K1691/1882K1695/1882K1699/1882K1703/1882K1707/1882K1711/1882K1715/1882K1719/1882K1723/1882K1727/1882K1731/1882K1735/1882K1739/1882K1743/1882K1747/1882K1751/1882K1755/1882K1759/1882K1763/1882K1767/1882K1771/1882K1775/1882K1779/1882K1783/1882K1787/1882K1791/1882K1795/1882K1799/1882K1803/1882K1807/1882K1811/1882K1815/1882K1819/1882K1823/1882K1827/1882K1831/1882K1835/1882K1839/1882K1843/1882K1847/1882K1851/1882K1855/1882K1859/1882K1863/1882K1863/1882K1867/1882K1871/1882K1875/1882K1879/1882K1882/1882K1882K downloaded  (svnkit-1.3.1-1.jar)
4/36K8/36K12/36K16/36K20/36K24/36K28/36K32/36K36/36K36/36K36K downloaded  (maven-scm-provider-svn-commons-1.2.jar)
Downloading: http://repo1.maven.org/maven2/org/apache/maven/scm/maven-scm-provider-cvsexe/1.2/maven-scm-provider-cvsexe-1.2.jar
4/26K8/26K12/26K16/26K20/26K24/26K26/26K26K downloaded  (maven-scm-provider-cvsexe-1.2.jar)
Downloading: http://repo1.maven.org/maven2/org/apache/maven/scm/maven-scm-provider-cvs-commons/1.2/maven-scm-provider-cvs-commons-1.2.jar
4/69K8/69K12/69K16/69K20/69K24/69K28/69K32/69K36/69K40/69K44/69K48/69K52/69K56/69K60/69K64/69K68/69K69/69K69K downloaded  (maven-scm-provider-cvs-commons-1.2.jar)
Downloading: http://repo1.maven.org/maven2/org/apache/maven/scm/maven-scm-provider-starteam/1.2/maven-scm-provider-starteam-1.2.jar
4/69K8/69K12/69K16/69K20/69K24/69K28/69K32/69K36/69K40/69K44/69K48/69K52/69K56/69K60/69K64/69K68/69K69/69K69K downloaded  (maven-scm-provider-starteam-1.2.jar)
Downloading: http://repo1.maven.org/maven2/org/apache/maven/scm/maven-scm-provider-clearcase/1.2/maven-scm-provider-clearcase-1.2.jar
4/62K8/62K12/62K16/62K20/62K24/62K28/62K32/62K36/62K40/62K44/62K48/62K52/62K56/62K60/62K62/62K62K downloaded  (maven-scm-provider-clearcase-1.2.jar)
Downloading: http://repo1.maven.org/maven2/org/apache/maven/scm/maven-scm-provider-perforce/1.2/maven-scm-provider-perforce-1.2.jar
4/66K8/66K12/66K16/66K20/66K24/66K28/66K32/66K36/66K40/66K44/66K48/66K52/66K56/66K60/66K64/66K66/66K66K downloaded  (maven-scm-provider-perforce-1.2.jar)
Downloading: http://repo1.maven.org/maven2/org/apache/maven/scm/maven-scm-provider-hg/1.2/maven-scm-provider-hg-1.2.jar
4/51K8/51K12/51K16/51K20/51K24/51K28/51K32/51K36/51K40/51K44/51K48/51K51/51K51K downloaded  (maven-scm-provider-hg-1.2.jar)
[INFO] [buildnumber:create {execution: default}]
[INFO] Checking for local modifications: skipped.
[INFO] Updating project files from SCM: skipped.
[INFO] Executing: /bin/sh -c cd <https://builds.apache.org/job/OpenJPA-2.2.x/ws/> && svn --non-interactive info
[INFO] Working directory: <https://builds.apache.org/job/OpenJPA-2.2.x/ws/>
[WARNING] Cannot get the revision information from the scm repository, proceeding with revision of offline :
Exception while executing SCM command.
[INFO] Storing buildNumber: offline at timestamp: July 18, 2017 at 6:34 PM
[INFO] Executing: /bin/sh -c cd <https://builds.apache.org/job/OpenJPA-2.2.x/ws/> && svn --non-interactive info
[INFO] Working directory: <https://builds.apache.org/job/OpenJPA-2.2.x/ws/>
[INFO] ------------------------------------------------------------------------
[ERROR] BUILD ERROR
[INFO] ------------------------------------------------------------------------
[INFO] Cannot get the branch information from the scm repository :
Exception while executing SCM command.

java.io.IOException: error=2, No such file or directory
[INFO] ------------------------------------------------------------------------
[INFO] For more information, run Maven with the -e switch
[INFO] ------------------------------------------------------------------------
[INFO] Total time: 4 seconds
[INFO] Finished at: Tue Jul 18 18:34:05 UTC 2017
[INFO] Final Memory: 30M/1447M
[INFO] ------------------------------------------------------------------------
Build step 'Execute shell' marked build as failure
Archiving artifacts
Setting ANT_1_9_7_HOME=/home/jenkins/tools/ant/apache-ant-1.9.7
Setting JDK_1_6_LATEST__HOME=/home/jenkins/tools/java/latest1.6
Setting MAVEN_2_2_1_HOME=/home/jenkins/tools/maven/apache-maven-2.2.1
Recording test results
Setting ANT_1_9_7_HOME=/home/jenkins/tools/ant/apache-ant-1.9.7
Setting JDK_1_6_LATEST__HOME=/home/jenkins/tools/java/latest1.6
Setting MAVEN_2_2_1_HOME=/home/jenkins/tools/maven/apache-maven-2.2.1
ERROR: Step ?Publish JUnit test result report? failed: No test report files were found. Configuration error?
Setting ANT_1_9_7_HOME=/home/jenkins/tools/ant/apache-ant-1.9.7
Setting JDK_1_6_LATEST__HOME=/home/jenkins/tools/java/latest1.6
Setting MAVEN_2_2_1_HOME=/home/jenkins/tools/maven/apache-maven-2.2.1
Reply | Threaded
Open this post in threaded view
|  
Report Content as Inappropriate

Build failed in Jenkins: OpenJPA-2.2.x #4

Apache Jenkins Server-2
See <https://builds.apache.org/job/OpenJPA-2.2.x/4/display/redirect>

------------------------------------------
Started by user jgrassel
[EnvInject] - Loading node environment variables.
Building remotely on H26 (ubuntu xenial) in workspace <https://builds.apache.org/job/OpenJPA-2.2.x/ws/>
Updating https://svn.apache.org/repos/asf/openjpa/branches/2.2.x at revision '2017-07-18T18:39:15.536 +0000'
At revision 1802322

No changes for https://svn.apache.org/repos/asf/openjpa/branches/2.2.x since the previous build
Setting ANT_1_9_7_HOME=/home/jenkins/tools/ant/apache-ant-1.9.7
Setting JDK_1_6_LATEST__HOME=/home/jenkins/tools/java/latest1.6
Setting MAVEN_2_2_1_HOME=/home/jenkins/tools/maven/apache-maven-2.2.1
[OpenJPA-2.2.x] $ /bin/bash -xe /tmp/jenkins9117199442916568446.sh
+ export ANT_HOME=/home/jenkins/tools/ant/apache-ant-1.9.7
+ ANT_HOME=/home/jenkins/tools/ant/apache-ant-1.9.7
+ export JAVA_HOME=/home/jenkins/tools/java/latest1.6
+ JAVA_HOME=/home/jenkins/tools/java/latest1.6
+ export M2_HOME=/home/jenkins/tools/maven/apache-maven-2.2.1
+ M2_HOME=/home/jenkins/tools/maven/apache-maven-2.2.1
+ export PATH=/home/jenkins/tools/ant/apache-ant-1.9.7/bin:/home/jenkins/tools/java/latest1.6/bin:/home/jenkins/tools/maven/apache-maven-2.2.1/bin
+ PATH=/home/jenkins/tools/ant/apache-ant-1.9.7/bin:/home/jenkins/tools/java/latest1.6/bin:/home/jenkins/tools/maven/apache-maven-2.2.1/bin
+ mvn clean install
/home/jenkins/tools/maven/apache-maven-2.2.1/bin/mvn: 1: /home/jenkins/tools/maven/apache-maven-2.2.1/bin/mvn: uname: not found
Error getting environment vars for profile activation: java.io.IOException: Cannot run program "env": java.io.IOException: error=2, No such file or directory
[WARNING] Failed to initialize environment variable resolver. Skipping environment substitution in settings.
[WARNING] Failed to initialize environment variable resolver. Skipping environment substitution in settings.
[INFO] Scanning for projects...
[INFO] Reactor build order:
[INFO]   OpenJPA Parent POM
[INFO]   OpenJPA Utilities Library
[INFO]   OpenJPA Kernel
[INFO]   OpenJPA JDBC
[INFO]   OpenJPA Persistence
[INFO]   OpenJPA Persistence JDBC
[INFO]   OpenJPA Persistence Locking Tests
[INFO]   OpenJPA tools
[INFO]   OpenJPA Maven Plugin
[INFO]   OpenJPA XML Store
[INFO]   OpenJPA Slice
[INFO]   OpenJPA JEST
[INFO]   OpenJPA Aggregate Jar
[INFO]   OpenJPA Aggregate Jar with Dependencies
[INFO]   OpenJPA Project Docs and Assemblies
[INFO]   OpenJPA Examples
[INFO]   OpenJPA Examples - Simple
[INFO]   OpenJPA Examples - image-gallery
[INFO]   OpenJPA Examples - OpenBooks
[INFO]   OpenJPA Integration Tests
[INFO]   OpenJPA Integration Tests - Daytrader
[INFO]   OpenJPA Integration Tests - Examples
[INFO]   OpenJPA Integration Tests - SLF4JLogFactory
[INFO]   OpenJPA Integration Tests - JPA TCK
[INFO]   OpenJPA Integration Tests - Bean Validation
[INFO]   OpenJPA Integration Tests - JMX Platform MBeans
[WARNING] POM for 'biz.aQute:bndlib:pom:1.15.0:runtime' is invalid.

Its dependencies (if any) will NOT be available to the current build.
[INFO] ------------------------------------------------------------------------
[INFO] Building OpenJPA Parent POM
[INFO]    task-segment: [clean, install]
[INFO] ------------------------------------------------------------------------
[INFO] [clean:clean {execution: default-clean}]
[INFO] [buildnumber:create {execution: default}]
[INFO] Checking for local modifications: skipped.
[INFO] Updating project files from SCM: skipped.
[INFO] Executing: /bin/sh -c cd <https://builds.apache.org/job/OpenJPA-2.2.x/ws/> && svn --non-interactive info
[INFO] Working directory: <https://builds.apache.org/job/OpenJPA-2.2.x/ws/>
[WARNING] Cannot get the revision information from the scm repository, proceeding with revision of offline :
Exception while executing SCM command.
[INFO] Storing buildNumber: offline at timestamp: July 18, 2017 at 6:39 PM
[INFO] Executing: /bin/sh -c cd <https://builds.apache.org/job/OpenJPA-2.2.x/ws/> && svn --non-interactive info
[INFO] Working directory: <https://builds.apache.org/job/OpenJPA-2.2.x/ws/>
[INFO] ------------------------------------------------------------------------
[ERROR] BUILD ERROR
[INFO] ------------------------------------------------------------------------
[INFO] Cannot get the branch information from the scm repository :
Exception while executing SCM command.

java.io.IOException: error=2, No such file or directory
[INFO] ------------------------------------------------------------------------
[INFO] For more information, run Maven with the -e switch
[INFO] ------------------------------------------------------------------------
[INFO] Total time: 2 seconds
[INFO] Finished at: Tue Jul 18 18:39:25 UTC 2017
[INFO] Final Memory: 36M/1824M
[INFO] ------------------------------------------------------------------------
Build step 'Execute shell' marked build as failure
Archiving artifacts
Setting ANT_1_9_7_HOME=/home/jenkins/tools/ant/apache-ant-1.9.7
Setting JDK_1_6_LATEST__HOME=/home/jenkins/tools/java/latest1.6
Setting MAVEN_2_2_1_HOME=/home/jenkins/tools/maven/apache-maven-2.2.1
Recording test results
Setting ANT_1_9_7_HOME=/home/jenkins/tools/ant/apache-ant-1.9.7
Setting JDK_1_6_LATEST__HOME=/home/jenkins/tools/java/latest1.6
Setting MAVEN_2_2_1_HOME=/home/jenkins/tools/maven/apache-maven-2.2.1
ERROR: Step ?Publish JUnit test result report? failed: No test report files were found. Configuration error?
Setting ANT_1_9_7_HOME=/home/jenkins/tools/ant/apache-ant-1.9.7
Setting JDK_1_6_LATEST__HOME=/home/jenkins/tools/java/latest1.6
Setting MAVEN_2_2_1_HOME=/home/jenkins/tools/maven/apache-maven-2.2.1
Loading...