Build failed in Jenkins: OpenJPA-2.3.x #1

classic Classic list List threaded Threaded
2 messages Options
Reply | Threaded
Open this post in threaded view
|  
Report Content as Inappropriate

Build failed in Jenkins: OpenJPA-2.3.x #1

Apache Jenkins Server-2
See <https://builds.apache.org/job/OpenJPA-2.3.x/1/display/redirect>

------------------------------------------
[...truncated 4.45 MB...]
4  cache-mode-enable  INFO   [main] openjpa.Runtime - Starting OpenJPA 2.3.1-SNAPSHOT
8  cache-mode-enable  INFO   [main] openjpa.jdbc.JDBC - Connected to Apache Derby version 10.10 using JDBC driver Apache Derby Embedded JDBC Driver version 10.8.2.2 - (1181258).
1  cache-mode-enable  WARN   [main] openjpa.DataCache - You have specified the openjpa.DataCache property "ExcludeTypes", but using that property is not recommended. Use the JPA 2.0 shared-cache-mode element "DISABLE_SELECTIVE" in conjunction with the javax.persistence.Cacheable annotation instead.
1  cache-mode-enable  INFO   [main] openjpa.jdbc.JDBC - Using dictionary class "org.apache.openjpa.jdbc.sql.DerbyDictionary".
3  cache-mode-enable  INFO   [main] openjpa.Runtime - Starting OpenJPA 2.3.1-SNAPSHOT
8  cache-mode-enable  INFO   [main] openjpa.jdbc.JDBC - Connected to Apache Derby version 10.10 using JDBC driver Apache Derby Embedded JDBC Driver version 10.8.2.2 - (1181258).
1  cache-mode-enable  WARN   [main] openjpa.DataCache - You have specified the openjpa.DataCache property "ExcludeTypes", but using that property is not recommended. Use the JPA 2.0 shared-cache-mode element "DISABLE_SELECTIVE" in conjunction with the javax.persistence.Cacheable annotation instead.
2  cache-mode-enable  INFO   [main] openjpa.jdbc.JDBC - Using dictionary class "org.apache.openjpa.jdbc.sql.DerbyDictionary".
4  cache-mode-enable  INFO   [main] openjpa.Runtime - Starting OpenJPA 2.3.1-SNAPSHOT
8  cache-mode-enable  INFO   [main] openjpa.jdbc.JDBC - Connected to Apache Derby version 10.10 using JDBC driver Apache Derby Embedded JDBC Driver version 10.8.2.2 - (1181258).
1  cache-mode-enable  WARN   [main] openjpa.DataCache - You have specified the openjpa.DataCache property "ExcludeTypes", but using that property is not recommended. Use the JPA 2.0 shared-cache-mode element "DISABLE_SELECTIVE" in conjunction with the javax.persistence.Cacheable annotation instead.
2  cache-mode-enable  INFO   [main] openjpa.jdbc.JDBC - Using dictionary class "org.apache.openjpa.jdbc.sql.DerbyDictionary".
4  cache-mode-enable  INFO   [main] openjpa.Runtime - Starting OpenJPA 2.3.1-SNAPSHOT
9  cache-mode-enable  INFO   [main] openjpa.jdbc.JDBC - Connected to Apache Derby version 10.10 using JDBC driver Apache Derby Embedded JDBC Driver version 10.8.2.2 - (1181258).
2  cache-mode-enable  WARN   [main] openjpa.DataCache - You have specified the openjpa.DataCache property "ExcludeTypes", but using that property is not recommended. Use the JPA 2.0 shared-cache-mode element "DISABLE_SELECTIVE" in conjunction with the javax.persistence.Cacheable annotation instead.
2  cache-mode-enable  INFO   [main] openjpa.jdbc.JDBC - Using dictionary class "org.apache.openjpa.jdbc.sql.DerbyDictionary".
4  cache-mode-enable  INFO   [main] openjpa.Runtime - Starting OpenJPA 2.3.1-SNAPSHOT
8  cache-mode-enable  INFO   [main] openjpa.jdbc.JDBC - Connected to Apache Derby version 10.10 using JDBC driver Apache Derby Embedded JDBC Driver version 10.8.2.2 - (1181258).
1  cache-mode-enable  WARN   [main] openjpa.DataCache - You have specified the openjpa.DataCache property "ExcludeTypes", but using that property is not recommended. Use the JPA 2.0 shared-cache-mode element "DISABLE_SELECTIVE" in conjunction with the javax.persistence.Cacheable annotation instead.
2  cache-mode-enable  INFO   [main] openjpa.jdbc.JDBC - Using dictionary class "org.apache.openjpa.jdbc.sql.DerbyDictionary".
4  cache-mode-enable  INFO   [main] openjpa.Runtime - Starting OpenJPA 2.3.1-SNAPSHOT
8  cache-mode-enable  INFO   [main] openjpa.jdbc.JDBC - Connected to Apache Derby version 10.10 using JDBC driver Apache Derby Embedded JDBC Driver version 10.8.2.2 - (1181258).
1  cache-mode-enable  WARN   [main] openjpa.DataCache - You have specified the openjpa.DataCache property "ExcludeTypes", but using that property is not recommended. Use the JPA 2.0 shared-cache-mode element "DISABLE_SELECTIVE" in conjunction with the javax.persistence.Cacheable annotation instead.
2  cache-mode-enable  INFO   [main] openjpa.jdbc.JDBC - Using dictionary class "org.apache.openjpa.jdbc.sql.DerbyDictionary".
4  cache-mode-enable  INFO   [main] openjpa.Runtime - Starting OpenJPA 2.3.1-SNAPSHOT
8  cache-mode-enable  INFO   [main] openjpa.jdbc.JDBC - Connected to Apache Derby version 10.10 using JDBC driver Apache Derby Embedded JDBC Driver version 10.8.2.2 - (1181258).
1  cache-mode-enable  WARN   [main] openjpa.DataCache - You have specified the openjpa.DataCache property "ExcludeTypes", but using that property is not recommended. Use the JPA 2.0 shared-cache-mode element "DISABLE_SELECTIVE" in conjunction with the javax.persistence.Cacheable annotation instead.
2  cache-mode-enable  INFO   [main] openjpa.jdbc.JDBC - Using dictionary class "org.apache.openjpa.jdbc.sql.DerbyDictionary".
4  cache-mode-enable  INFO   [main] openjpa.Runtime - Starting OpenJPA 2.3.1-SNAPSHOT
8  cache-mode-enable  INFO   [main] openjpa.jdbc.JDBC - Connected to Apache Derby version 10.10 using JDBC driver Apache Derby Embedded JDBC Driver version 10.8.2.2 - (1181258).
1  cache-mode-enable  WARN   [main] openjpa.DataCache - You have specified the openjpa.DataCache property "ExcludeTypes", but using that property is not recommended. Use the JPA 2.0 shared-cache-mode element "DISABLE_SELECTIVE" in conjunction with the javax.persistence.Cacheable annotation instead.
2  cache-mode-enable  INFO   [main] openjpa.jdbc.JDBC - Using dictionary class "org.apache.openjpa.jdbc.sql.DerbyDictionary".
4  cache-mode-enable  INFO   [main] openjpa.Runtime - Starting OpenJPA 2.3.1-SNAPSHOT
8  cache-mode-enable  INFO   [main] openjpa.jdbc.JDBC - Connected to Apache Derby version 10.10 using JDBC driver Apache Derby Embedded JDBC Driver version 10.8.2.2 - (1181258).
Tests run: 16, Failures: 0, Errors: 0, Skipped: 0, Time elapsed: 2.107 sec
Running org.apache.openjpa.persistence.arrays.TestXMLExceptionEntity
1  arrays  INFO   [main] openjpa.Runtime - Starting OpenJPA 2.3.1-SNAPSHOT
1  arrays  INFO   [main] openjpa.jdbc.JDBC - Using dictionary class "org.apache.openjpa.jdbc.sql.DerbyDictionary".
7  arrays  INFO   [main] openjpa.jdbc.JDBC - Connected to Apache Derby version 10.10 using JDBC driver Apache Derby Embedded JDBC Driver version 10.8.2.2 - (1181258).
0  arrays  INFO   [main] openjpa.Runtime - Starting OpenJPA 2.3.1-SNAPSHOT
1  arrays  INFO   [main] openjpa.jdbc.JDBC - Using dictionary class "org.apache.openjpa.jdbc.sql.DerbyDictionary".
7  arrays  INFO   [main] openjpa.jdbc.JDBC - Connected to Apache Derby version 10.10 using JDBC driver Apache Derby Embedded JDBC Driver version 10.8.2.2 - (1181258).
0  arrays  INFO   [main] openjpa.Runtime - Starting OpenJPA 2.3.1-SNAPSHOT
1  arrays  INFO   [main] openjpa.jdbc.JDBC - Using dictionary class "org.apache.openjpa.jdbc.sql.DerbyDictionary".
7  arrays  INFO   [main] openjpa.jdbc.JDBC - Connected to Apache Derby version 10.10 using JDBC driver Apache Derby Embedded JDBC Driver version 10.8.2.2 - (1181258).
Tests run: 3, Failures: 0, Errors: 0, Skipped: 0, Time elapsed: 0.236 sec
Running org.apache.openjpa.persistence.inheritance.TestDefaultInheritanceStrategy
0  test  INFO   [main] openjpa.Runtime - Starting OpenJPA 2.3.1-SNAPSHOT
1  test  INFO   [main] openjpa.jdbc.JDBC - Using dictionary class "org.apache.openjpa.jdbc.sql.DerbyDictionary".
7  test  INFO   [main] openjpa.jdbc.JDBC - Connected to Apache Derby version 10.10 using JDBC driver Apache Derby Embedded JDBC Driver version 10.8.2.2 - (1181258).
0  test  INFO   [main] openjpa.Runtime - Starting OpenJPA 2.3.1-SNAPSHOT
1  test  INFO   [main] openjpa.jdbc.JDBC - Using dictionary class "org.apache.openjpa.jdbc.sql.DerbyDictionary".
7  test  INFO   [main] openjpa.jdbc.JDBC - Connected to Apache Derby version 10.10 using JDBC driver Apache Derby Embedded JDBC Driver version 10.8.2.2 - (1181258).
0  test  INFO   [main] openjpa.Runtime - Starting OpenJPA 2.3.1-SNAPSHOT
1  test  INFO   [main] openjpa.jdbc.JDBC - Using dictionary class "org.apache.openjpa.jdbc.sql.DerbyDictionary".
7  test  INFO   [main] openjpa.jdbc.JDBC - Connected to Apache Derby version 10.10 using JDBC driver Apache Derby Embedded JDBC Driver version 10.8.2.2 - (1181258).
0  test  INFO   [main] openjpa.Runtime - Starting OpenJPA 2.3.1-SNAPSHOT
1  test  INFO   [main] openjpa.jdbc.JDBC - Using dictionary class "org.apache.openjpa.jdbc.sql.DerbyDictionary".
7  test  INFO   [main] openjpa.jdbc.JDBC - Connected to Apache Derby version 10.10 using JDBC driver Apache Derby Embedded JDBC Driver version 10.8.2.2 - (1181258).
1  test  INFO   [main] openjpa.Runtime - Starting OpenJPA 2.3.1-SNAPSHOT
1  test  INFO   [main] openjpa.jdbc.JDBC - Using dictionary class "org.apache.openjpa.jdbc.sql.DerbyDictionary".
7  test  INFO   [main] openjpa.jdbc.JDBC - Connected to Apache Derby version 10.10 using JDBC driver Apache Derby Embedded JDBC Driver version 10.8.2.2 - (1181258).
0  test  INFO   [main] openjpa.Runtime - Starting OpenJPA 2.3.1-SNAPSHOT
1  test  INFO   [main] openjpa.jdbc.JDBC - Using dictionary class "org.apache.openjpa.jdbc.sql.DerbyDictionary".
7  test  INFO   [main] openjpa.jdbc.JDBC - Connected to Apache Derby version 10.10 using JDBC driver Apache Derby Embedded JDBC Driver version 10.8.2.2 - (1181258).
0  test  INFO   [main] openjpa.Runtime - Starting OpenJPA 2.3.1-SNAPSHOT
1  test  INFO   [main] openjpa.jdbc.JDBC - Using dictionary class "org.apache.openjpa.jdbc.sql.DerbyDictionary".
7  test  INFO   [main] openjpa.jdbc.JDBC - Connected to Apache Derby version 10.10 using JDBC driver Apache Derby Embedded JDBC Driver version 10.8.2.2 - (1181258).
0  test  INFO   [main] openjpa.Runtime - Starting OpenJPA 2.3.1-SNAPSHOT
1  test  INFO   [main] openjpa.jdbc.JDBC - Using dictionary class "org.apache.openjpa.jdbc.sql.DerbyDictionary".
7  test  INFO   [main] openjpa.jdbc.JDBC - Connected to Apache Derby version 10.10 using JDBC driver Apache Derby Embedded JDBC Driver version 10.8.2.2 - (1181258).
0  test  INFO   [main] openjpa.Runtime - Starting OpenJPA 2.3.1-SNAPSHOT
1  test  INFO   [main] openjpa.jdbc.JDBC - Using dictionary class "org.apache.openjpa.jdbc.sql.DerbyDictionary".
7  test  INFO   [main] openjpa.jdbc.JDBC - Connected to Apache Derby version 10.10 using JDBC driver Apache Derby Embedded JDBC Driver version 10.8.2.2 - (1181258).
0  test  INFO   [main] openjpa.Runtime - Starting OpenJPA 2.3.1-SNAPSHOT
1  test  INFO   [main] openjpa.jdbc.JDBC - Using dictionary class "org.apache.openjpa.jdbc.sql.DerbyDictionary".
7  test  INFO   [main] openjpa.jdbc.JDBC - Connected to Apache Derby version 10.10 using JDBC driver Apache Derby Embedded JDBC Driver version 10.8.2.2 - (1181258).
Tests run: 10, Failures: 0, Errors: 0, Skipped: 0, Time elapsed: 2.121 sec
Running org.apache.openjpa.persistence.detachment.TestDetachNoStateField
1  test  INFO   [main] openjpa.Runtime - Starting OpenJPA 2.3.1-SNAPSHOT
2  test  INFO   [main] openjpa.jdbc.JDBC - Using dictionary class "org.apache.openjpa.jdbc.sql.DerbyDictionary".
8  test  INFO   [main] openjpa.jdbc.JDBC - Connected to Apache Derby version 10.10 using JDBC driver Apache Derby Embedded JDBC Driver version 10.8.2.2 - (1181258).
0  test  INFO   [main] openjpa.Runtime - Starting OpenJPA 2.3.1-SNAPSHOT
1  test  INFO   [main] openjpa.jdbc.JDBC - Using dictionary class "org.apache.openjpa.jdbc.sql.DerbyDictionary".
7  test  INFO   [main] openjpa.jdbc.JDBC - Connected to Apache Derby version 10.10 using JDBC driver Apache Derby Embedded JDBC Driver version 10.8.2.2 - (1181258).
0  test  INFO   [main] openjpa.Runtime - Starting OpenJPA 2.3.1-SNAPSHOT
1  test  INFO   [main] openjpa.jdbc.JDBC - Using dictionary class "org.apache.openjpa.jdbc.sql.DerbyDictionary".
7  test  INFO   [main] openjpa.jdbc.JDBC - Connected to Apache Derby version 10.10 using JDBC driver Apache Derby Embedded JDBC Driver version 10.8.2.2 - (1181258).
Tests run: 3, Failures: 0, Errors: 0, Skipped: 0, Time elapsed: 0.553 sec
Running org.apache.openjpa.persistence.detachment.TestAttachConstructedCopy
1  test  INFO   [main] openjpa.Runtime - Starting OpenJPA 2.3.1-SNAPSHOT
2  test  INFO   [main] openjpa.jdbc.JDBC - Using dictionary class "org.apache.openjpa.jdbc.sql.DerbyDictionary".
8  test  INFO   [main] openjpa.jdbc.JDBC - Connected to Apache Derby version 10.10 using JDBC driver Apache Derby Embedded JDBC Driver version 10.8.2.2 - (1181258).
Tests run: 1, Failures: 0, Errors: 0, Skipped: 0, Time elapsed: 0.071 sec
Running org.apache.openjpa.persistence.fields.TestEnumSets
1  test  INFO   [main] openjpa.Runtime - Starting OpenJPA 2.3.1-SNAPSHOT
1  test  INFO   [main] openjpa.jdbc.JDBC - Using dictionary class "org.apache.openjpa.jdbc.sql.DerbyDictionary".
7  test  INFO   [main] openjpa.jdbc.JDBC - Connected to Apache Derby version 10.10 using JDBC driver Apache Derby Embedded JDBC Driver version 10.8.2.2 - (1181258).
Tests run: 1, Failures: 0, Errors: 0, Skipped: 0, Time elapsed: 0.068 sec
Running org.apache.openjpa.persistence.TestOpenjpaIdNotRecognizedMessage
1  test  INFO   [main] openjpa.Runtime - Starting OpenJPA 2.3.1-SNAPSHOT
1  test  INFO   [main] openjpa.jdbc.JDBC - Using dictionary class "org.apache.openjpa.jdbc.sql.DerbyDictionary".
7  test  INFO   [main] openjpa.jdbc.JDBC - Connected to Apache Derby version 10.10 using JDBC driver Apache Derby Embedded JDBC Driver version 10.8.2.2 - (1181258).
Tests run: 1, Failures: 0, Errors: 0, Skipped: 0, Time elapsed: 0.061 sec
Running org.apache.openjpa.persistence.annotations.TestOneToOne
1  TestConv  INFO   [main] openjpa.Runtime - Starting OpenJPA 2.3.1-SNAPSHOT
2  TestConv  INFO   [main] openjpa.jdbc.JDBC - Using dictionary class "org.apache.openjpa.jdbc.sql.DerbyDictionary".
8  TestConv  INFO   [main] openjpa.jdbc.JDBC - Connected to Apache Derby version 10.10 using JDBC driver Apache Derby Embedded JDBC Driver version 10.8.2.2 - (1181258).
31  TestConv  WARN   [main] openjpa.MetaData - The composite identity class "class org.apache.openjpa.persistence.annotations.common.apps.annotApp.annotype.AnnoTest2$Oid" for entity "class org.apache.openjpa.persistence.annotations.common.apps.annotApp.annotype.AnnoTest2" is not serializable.
40  TestConv  WARN   [main] openjpa.MetaData - The composite identity class "class org.apache.openjpa.persistence.annotations.common.apps.annotApp.annotype.Generator$Oid" for entity "class org.apache.openjpa.persistence.annotations.common.apps.annotApp.annotype.Generator" is not serializable.
400  TestConv  WARN   [main] openjpa.MetaData - The composite identity class "class org.apache.openjpa.persistence.annotations.common.apps.annotApp.annotype.AnnoTest2$Oid" for entity "class org.apache.openjpa.persistence.annotations.common.apps.annotApp.annotype.AnnoTest2" is not serializable.
0  TestConv  INFO   [main] openjpa.Runtime - Starting OpenJPA 2.3.1-SNAPSHOT
1  TestConv  INFO   [main] openjpa.jdbc.JDBC - Using dictionary class "org.apache.openjpa.jdbc.sql.DerbyDictionary".
7  TestConv  INFO   [main] openjpa.jdbc.JDBC - Connected to Apache Derby version 10.10 using JDBC driver Apache Derby Embedded JDBC Driver version 10.8.2.2 - (1181258).
28  TestConv  WARN   [main] openjpa.MetaData - The composite identity class "class org.apache.openjpa.persistence.annotations.common.apps.annotApp.annotype.AnnoTest2$Oid" for entity "class org.apache.openjpa.persistence.annotations.common.apps.annotApp.annotype.AnnoTest2" is not serializable.
38  TestConv  WARN   [main] openjpa.MetaData - The composite identity class "class org.apache.openjpa.persistence.annotations.common.apps.annotApp.annotype.Generator$Oid" for entity "class org.apache.openjpa.persistence.annotations.common.apps.annotApp.annotype.Generator" is not serializable.
185  TestConv  WARN   [main] openjpa.MetaData - The composite identity class "class org.apache.openjpa.persistence.annotations.common.apps.annotApp.annotype.AnnoTest2$Oid" for entity "class org.apache.openjpa.persistence.annotations.common.apps.annotApp.annotype.AnnoTest2" is not serializable.
0  TestConv  INFO   [main] openjpa.Runtime - Starting OpenJPA 2.3.1-SNAPSHOT
1  TestConv  INFO   [main] openjpa.jdbc.JDBC - Using dictionary class "org.apache.openjpa.jdbc.sql.DerbyDictionary".
7  TestConv  INFO   [main] openjpa.jdbc.JDBC - Connected to Apache Derby version 10.10 using JDBC driver Apache Derby Embedded JDBC Driver version 10.8.2.2 - (1181258).
29  TestConv  WARN   [main] openjpa.MetaData - The composite identity class "class org.apache.openjpa.persistence.annotations.common.apps.annotApp.annotype.AnnoTest2$Oid" for entity "class org.apache.openjpa.persistence.annotations.common.apps.annotApp.annotype.AnnoTest2" is not serializable.
38  TestConv  WARN   [main] openjpa.MetaData - The composite identity class "class org.apache.openjpa.persistence.annotations.common.apps.annotApp.annotype.Generator$Oid" for entity "class org.apache.openjpa.persistence.annotations.common.apps.annotApp.annotype.Generator" is not serializable.
301  TestConv  WARN   [main] openjpa.MetaData - The composite identity class "class org.apache.openjpa.persistence.annotations.common.apps.annotApp.annotype.AnnoTest2$Oid" for entity "class org.apache.openjpa.persistence.annotations.common.apps.annotApp.annotype.AnnoTest2" is not serializable.
0  TestConv  INFO   [main] openjpa.Runtime - Starting OpenJPA 2.3.1-SNAPSHOT
1  TestConv  INFO   [main] openjpa.jdbc.JDBC - Using dictionary class "org.apache.openjpa.jdbc.sql.DerbyDictionary".
7  TestConv  INFO   [main] openjpa.jdbc.JDBC - Connected to Apache Derby version 10.10 using JDBC driver Apache Derby Embedded JDBC Driver version 10.8.2.2 - (1181258).
28  TestConv  WARN   [main] openjpa.MetaData - The composite identity class "class org.apache.openjpa.persistence.annotations.common.apps.annotApp.annotype.AnnoTest2$Oid" for entity "class org.apache.openjpa.persistence.annotations.common.apps.annotApp.annotype.AnnoTest2" is not serializable.
38  TestConv  WARN   [main] openjpa.MetaData - The composite identity class "class org.apache.openjpa.persistence.annotations.common.apps.annotApp.annotype.Generator$Oid" for entity "class org.apache.openjpa.persistence.annotations.common.apps.annotApp.annotype.Generator" is not serializable.
180  TestConv  WARN   [main] openjpa.MetaData - The composite identity class "class org.apache.openjpa.persistence.annotations.common.apps.annotApp.annotype.AnnoTest2$Oid" for entity "class org.apache.openjpa.persistence.annotations.common.apps.annotApp.annotype.AnnoTest2" is not serializable.
1  TestConv  INFO   [main] openjpa.Runtime - Starting OpenJPA 2.3.1-SNAPSHOT
1  TestConv  INFO   [main] openjpa.jdbc.JDBC - Using dictionary class "org.apache.openjpa.jdbc.sql.DerbyDictionary".
8  TestConv  INFO   [main] openjpa.jdbc.JDBC - Connected to Apache Derby version 10.10 using JDBC driver Apache Derby Embedded JDBC Driver version 10.8.2.2 - (1181258).
28  TestConv  WARN   [main] openjpa.MetaData - The composite identity class "class org.apache.openjpa.persistence.annotations.common.apps.annotApp.annotype.AnnoTest2$Oid" for entity "class org.apache.openjpa.persistence.annotations.common.apps.annotApp.annotype.AnnoTest2" is not serializable.
38  TestConv  WARN   [main] openjpa.MetaData - The composite identity class "class org.apache.openjpa.persistence.annotations.common.apps.annotApp.annotype.Generator$Oid" for entity "class org.apache.openjpa.persistence.annotations.common.apps.annotApp.annotype.Generator" is not serializable.
176  TestConv  WARN   [main] openjpa.MetaData - The composite identity class "class org.apache.openjpa.persistence.annotations.common.apps.annotApp.annotype.AnnoTest2$Oid" for entity "class org.apache.openjpa.persistence.annotations.common.apps.annotApp.annotype.AnnoTest2" is not serializable.
Tests run: 5, Failures: 0, Errors: 0, Skipped: 0, Time elapsed: 1.431 sec
Running org.apache.openjpa.persistence.kernel.TestEJBEntityManager
0  test  INFO   [main] openjpa.Runtime - Starting OpenJPA 2.3.1-SNAPSHOT
1  test  INFO   [main] openjpa.jdbc.JDBC - Using dictionary class "org.apache.openjpa.jdbc.sql.DerbyDictionary".
7  test  INFO   [main] openjpa.jdbc.JDBC - Connected to Apache Derby version 10.10 using JDBC driver Apache Derby Embedded JDBC Driver version 10.8.2.2 - (1181258).
1  test  INFO   [main] openjpa.Runtime - Starting OpenJPA 2.3.1-SNAPSHOT
1  test  INFO   [main] openjpa.jdbc.JDBC - Using dictionary class "org.apache.openjpa.jdbc.sql.DerbyDictionary".
7  test  INFO   [main] openjpa.jdbc.JDBC - Connected to Apache Derby version 10.10 using JDBC driver Apache Derby Embedded JDBC Driver version 10.8.2.2 - (1181258).
Tests run: 2, Failures: 0, Errors: 0, Skipped: 0, Time elapsed: 0.104 sec
Running org.apache.openjpa.persistence.generationtype.TestMultipleSchemaNames
0  test  INFO   [main] openjpa.jdbc.JDBC - Using dictionary class "org.apache.openjpa.jdbc.sql.DerbyDictionary".
1  test  INFO   [main] openjpa.jdbc.JDBC - Using dictionary class "org.apache.openjpa.jdbc.sql.DerbyDictionary".
1  test  INFO   [main] openjpa.Runtime - Starting OpenJPA 2.3.1-SNAPSHOT
1  test  INFO   [main] openjpa.jdbc.JDBC - Using dictionary class "org.apache.openjpa.jdbc.sql.DerbyDictionary".
7  test  INFO   [main] openjpa.jdbc.JDBC - Connected to Apache Derby version 10.10 using JDBC driver Apache Derby Embedded JDBC Driver version 10.8.2.2 - (1181258).
1  test  INFO   [main] openjpa.jdbc.JDBC - Using dictionary class "org.apache.openjpa.jdbc.sql.DerbyDictionary".
0  test  INFO   [main] openjpa.Runtime - Starting OpenJPA 2.3.1-SNAPSHOT
1  test  INFO   [main] openjpa.jdbc.JDBC - Using dictionary class "org.apache.openjpa.jdbc.sql.DerbyDictionary".
7  test  INFO   [main] openjpa.jdbc.JDBC - Connected to Apache Derby version 10.10 using JDBC driver Apache Derby Embedded JDBC Driver version 10.8.2.2 - (1181258).
0  test  INFO   [main] openjpa.jdbc.JDBC - Using dictionary class "org.apache.openjpa.jdbc.sql.DerbyDictionary".
1  test  INFO   [main] openjpa.Runtime - Starting OpenJPA 2.3.1-SNAPSHOT
1  test  INFO   [main] openjpa.jdbc.JDBC - Using dictionary class "org.apache.openjpa.jdbc.sql.DerbyDictionary".
7  test  INFO   [main] openjpa.jdbc.JDBC - Connected to Apache Derby version 10.10 using JDBC driver Apache Derby Embedded JDBC Driver version 10.8.2.2 - (1181258).
Tests run: 3, Failures: 0, Errors: 0, Skipped: 0, Time elapsed: 0.997 sec
Running org.apache.openjpa.persistence.query.TestQueryResultClassAPI
1  test  INFO   [main] openjpa.Runtime - Starting OpenJPA 2.3.1-SNAPSHOT
1  test  INFO   [main] openjpa.jdbc.JDBC - Using dictionary class "org.apache.openjpa.jdbc.sql.DerbyDictionary".
8  test  INFO   [main] openjpa.jdbc.JDBC - Connected to Apache Derby version 10.10 using JDBC driver Apache Derby Embedded JDBC Driver version 10.8.2.2 - (1181258).
Tests run: 1, Failures: 0, Errors: 0, Skipped: 0, Time elapsed: 0.193 sec
Running org.apache.openjpa.persistence.query.TestProjectionQueryWithIdenticalResult
1  test  INFO   [main] openjpa.Runtime - Starting OpenJPA 2.3.1-SNAPSHOT
1  test  INFO   [main] openjpa.jdbc.JDBC - Using dictionary class "org.apache.openjpa.jdbc.sql.DerbyDictionary".
7  test  INFO   [main] openjpa.jdbc.JDBC - Connected to Apache Derby version 10.10 using JDBC driver Apache Derby Embedded JDBC Driver version 10.8.2.2 - (1181258).
0  test  INFO   [main] openjpa.Runtime - Starting OpenJPA 2.3.1-SNAPSHOT
1  test  INFO   [main] openjpa.jdbc.JDBC - Using dictionary class "org.apache.openjpa.jdbc.sql.DerbyDictionary".
7  test  INFO   [main] openjpa.jdbc.JDBC - Connected to Apache Derby version 10.10 using JDBC driver Apache Derby Embedded JDBC Driver version 10.8.2.2 - (1181258).
1  test  INFO   [main] openjpa.Runtime - Starting OpenJPA 2.3.1-SNAPSHOT
1  test  INFO   [main] openjpa.jdbc.JDBC - Using dictionary class "org.apache.openjpa.jdbc.sql.DerbyDictionary".
7  test  INFO   [main] openjpa.jdbc.JDBC - Connected to Apache Derby version 10.10 using JDBC driver Apache Derby Embedded JDBC Driver version 10.8.2.2 - (1181258).
1  test  INFO   [main] openjpa.Runtime - Starting OpenJPA 2.3.1-SNAPSHOT
1  test  INFO   [main] openjpa.jdbc.JDBC - Using dictionary class "org.apache.openjpa.jdbc.sql.DerbyDictionary".
8  test  INFO   [main] openjpa.jdbc.JDBC - Connected to Apache Derby version 10.10 using JDBC driver Apache Derby Embedded JDBC Driver version 10.8.2.2 - (1181258).
Tests run: 4, Failures: 0, Errors: 0, Skipped: 0, Time elapsed: 0.352 sec
Running org.apache.openjpa.persistence.dynamicschema.TestResWordEntity
1  test  INFO   [main] openjpa.Runtime - Starting OpenJPA 2.3.1-SNAPSHOT
1  test  INFO   [main] openjpa.jdbc.JDBC - Using dictionary class "org.apache.openjpa.jdbc.sql.DerbyDictionary".
7  test  INFO   [main] openjpa.jdbc.JDBC - Connected to Apache Derby version 10.10 using JDBC driver Apache Derby Embedded JDBC Driver version 10.8.2.2 - (1181258).
1  test  INFO   [main] openjpa.Runtime - Starting OpenJPA 2.3.1-SNAPSHOT
1  test  INFO   [main] openjpa.jdbc.JDBC - Using dictionary class "org.apache.openjpa.jdbc.sql.DerbyDictionary".
7  test  INFO   [main] openjpa.jdbc.JDBC - Connected to Apache Derby version 10.10 using JDBC driver Apache Derby Embedded JDBC Driver version 10.8.2.2 - (1181258).
0  test  INFO   [main] openjpa.Runtime - Starting OpenJPA 2.3.1-SNAPSHOT
0  test  INFO   [main] openjpa.jdbc.JDBC - Using dictionary class "org.apache.openjpa.jdbc.sql.DerbyDictionary".
7  test  INFO   [main] openjpa.jdbc.JDBC - Connected to Apache Derby version 10.10 using JDBC driver Apache Derby Embedded JDBC Driver version 10.8.2.2 - (1181258).
0  test  INFO   [main] openjpa.Runtime - Starting OpenJPA 2.3.1-SNAPSHOT
0  test  INFO   [main] openjpa.jdbc.JDBC - Using dictionary class "org.apache.openjpa.jdbc.sql.DerbyDictionary".
7  test  INFO   [main] openjpa.jdbc.JDBC - Connected to Apache Derby version 10.10 using JDBC driver Apache Derby Embedded JDBC Driver version 10.8.2.2 - (1181258).
Tests run: 4, Failures: 0, Errors: 0, Skipped: 0, Time elapsed: 0.168 sec
Running org.apache.openjpa.persistence.identity.TestBooleanId
2  test  INFO   [main] openjpa.Runtime - Starting OpenJPA 2.3.1-SNAPSHOT
3  test  INFO   [main] openjpa.jdbc.JDBC - Using dictionary class "org.apache.openjpa.jdbc.sql.DerbyDictionary".
9  test  INFO   [main] openjpa.jdbc.JDBC - Connected to Apache Derby version 10.10 using JDBC driver Apache Derby Embedded JDBC Driver version 10.8.2.2 - (1181258).
14  test  WARN   [main] openjpa.MetaData - The composite identity class "class org.apache.openjpa.persistence.identity.CompoundBooleanId" for entity "class org.apache.openjpa.persistence.identity.CompoundBooleanIdEntity" is not serializable.
0  test  INFO   [main] openjpa.Runtime - Starting OpenJPA 2.3.1-SNAPSHOT
1  test  INFO   [main] openjpa.jdbc.JDBC - Using dictionary class "org.apache.openjpa.jdbc.sql.DerbyDictionary".
7  test  INFO   [main] openjpa.jdbc.JDBC - Connected to Apache Derby version 10.10 using JDBC driver Apache Derby Embedded JDBC Driver version 10.8.2.2 - (1181258).
9  test  WARN   [main] openjpa.MetaData - The composite identity class "class org.apache.openjpa.persistence.identity.CompoundBooleanId" for entity "class org.apache.openjpa.persistence.identity.CompoundBooleanIdEntity" is not serializable.
118  test  WARN   [main] openjpa.MetaData - The composite identity class "class org.apache.openjpa.persistence.identity.CompoundBooleanId" for entity "class org.apache.openjpa.persistence.identity.CompoundBooleanIdEntity" is not serializable.
Tests run: 2, Failures: 0, Errors: 0, Skipped: 0, Time elapsed: 0.27 sec
Running org.apache.openjpa.persistence.kernel.TestEJBNullValues
1  test  INFO   [main] openjpa.Runtime - Starting OpenJPA 2.3.1-SNAPSHOT
1  test  INFO   [main] openjpa.jdbc.JDBC - Using dictionary class "org.apache.openjpa.jdbc.sql.DerbyDictionary".
7  test  INFO   [main] openjpa.jdbc.JDBC - Connected to Apache Derby version 10.10 using JDBC driver Apache Derby Embedded JDBC Driver version 10.8.2.2 - (1181258).
Tests run: 1, Failures: 0, Errors: 0, Skipped: 0, Time elapsed: 0.08 sec
Running org.apache.openjpa.persistence.models.company.joined.TestJoinedCompanyModel
1  test  INFO   [main] openjpa.Runtime - Starting OpenJPA 2.3.1-SNAPSHOT
1  test  INFO   [main] openjpa.jdbc.JDBC - Using dictionary class "org.apache.openjpa.jdbc.sql.DerbyDictionary".
7  test  INFO   [main] openjpa.jdbc.JDBC - Connected to Apache Derby version 10.10 using JDBC driver Apache Derby Embedded JDBC Driver version 10.8.2.2 - (1181258).
Tests run: 1, Failures: 0, Errors: 0, Skipped: 0, Time elapsed: 16.661 sec

Results :

Failed tests:
  testMappingCorrectID(org.apache.openjpa.persistence.query.sqlresultmapping.TestSQLResultSetMapping)

Tests in error:
  testMappingNoException(org.apache.openjpa.persistence.query.sqlresultmapping.TestSQLResultSetMapping)

Tests run: 3049, Failures: 1, Errors: 1, Skipped: 0

[INFO] ------------------------------------------------------------------------
[ERROR] BUILD FAILURE
[INFO] ------------------------------------------------------------------------
[INFO] There are test failures.

Please refer to <https://builds.apache.org/job/OpenJPA-2.3.x/ws/openjpa-persistence-jdbc/target/surefire-reports> for the individual test results.
[INFO] ------------------------------------------------------------------------
[INFO] For more information, run Maven with the -e switch
[INFO] ------------------------------------------------------------------------
[INFO] Total time: 20 minutes 51 seconds
[INFO] Finished at: Tue Jul 18 21:38:47 UTC 2017
[INFO] Final Memory: 141M/3049M
[INFO] ------------------------------------------------------------------------
Build step 'Execute shell' marked build as failure
Archiving artifacts
Setting ANT_1_9_7_HOME=/home/jenkins/tools/ant/apache-ant-1.9.7
Setting JDK_1_6_LATEST__HOME=/home/jenkins/tools/java/latest1.6
Setting MAVEN_2_2_1_HOME=/home/jenkins/tools/maven/apache-maven-2.2.1
Recording test results
Setting ANT_1_9_7_HOME=/home/jenkins/tools/ant/apache-ant-1.9.7
Setting JDK_1_6_LATEST__HOME=/home/jenkins/tools/java/latest1.6
Setting MAVEN_2_2_1_HOME=/home/jenkins/tools/maven/apache-maven-2.2.1
Setting ANT_1_9_7_HOME=/home/jenkins/tools/ant/apache-ant-1.9.7
Setting JDK_1_6_LATEST__HOME=/home/jenkins/tools/java/latest1.6
Setting MAVEN_2_2_1_HOME=/home/jenkins/tools/maven/apache-maven-2.2.1
Reply | Threaded
Open this post in threaded view
|  
Report Content as Inappropriate

Build failed in Jenkins: OpenJPA-2.3.x #2

Apache Jenkins Server-2
See <https://builds.apache.org/job/OpenJPA-2.3.x/2/display/redirect>

------------------------------------------
[...truncated 4.42 MB...]
2  cache-mode-enable  INFO   [main] openjpa.Runtime - Starting OpenJPA 2.3.1-SNAPSHOT
4  cache-mode-enable  INFO   [main] openjpa.jdbc.JDBC - Connected to Apache Derby version 10.10 using JDBC driver Apache Derby Embedded JDBC Driver version 10.8.2.2 - (1181258).
0  cache-mode-enable  WARN   [main] openjpa.DataCache - You have specified the openjpa.DataCache property "ExcludeTypes", but using that property is not recommended. Use the JPA 2.0 shared-cache-mode element "DISABLE_SELECTIVE" in conjunction with the javax.persistence.Cacheable annotation instead.
0  cache-mode-enable  INFO   [main] openjpa.jdbc.JDBC - Using dictionary class "org.apache.openjpa.jdbc.sql.DerbyDictionary".
1  cache-mode-enable  INFO   [main] openjpa.Runtime - Starting OpenJPA 2.3.1-SNAPSHOT
4  cache-mode-enable  INFO   [main] openjpa.jdbc.JDBC - Connected to Apache Derby version 10.10 using JDBC driver Apache Derby Embedded JDBC Driver version 10.8.2.2 - (1181258).
1  cache-mode-enable  WARN   [main] openjpa.DataCache - You have specified the openjpa.DataCache property "ExcludeTypes", but using that property is not recommended. Use the JPA 2.0 shared-cache-mode element "DISABLE_SELECTIVE" in conjunction with the javax.persistence.Cacheable annotation instead.
1  cache-mode-enable  INFO   [main] openjpa.jdbc.JDBC - Using dictionary class "org.apache.openjpa.jdbc.sql.DerbyDictionary".
2  cache-mode-enable  INFO   [main] openjpa.Runtime - Starting OpenJPA 2.3.1-SNAPSHOT
4  cache-mode-enable  INFO   [main] openjpa.jdbc.JDBC - Connected to Apache Derby version 10.10 using JDBC driver Apache Derby Embedded JDBC Driver version 10.8.2.2 - (1181258).
1  cache-mode-enable  WARN   [main] openjpa.DataCache - You have specified the openjpa.DataCache property "ExcludeTypes", but using that property is not recommended. Use the JPA 2.0 shared-cache-mode element "DISABLE_SELECTIVE" in conjunction with the javax.persistence.Cacheable annotation instead.
1  cache-mode-enable  INFO   [main] openjpa.jdbc.JDBC - Using dictionary class "org.apache.openjpa.jdbc.sql.DerbyDictionary".
2  cache-mode-enable  INFO   [main] openjpa.Runtime - Starting OpenJPA 2.3.1-SNAPSHOT
4  cache-mode-enable  INFO   [main] openjpa.jdbc.JDBC - Connected to Apache Derby version 10.10 using JDBC driver Apache Derby Embedded JDBC Driver version 10.8.2.2 - (1181258).
1  cache-mode-enable  WARN   [main] openjpa.DataCache - You have specified the openjpa.DataCache property "ExcludeTypes", but using that property is not recommended. Use the JPA 2.0 shared-cache-mode element "DISABLE_SELECTIVE" in conjunction with the javax.persistence.Cacheable annotation instead.
1  cache-mode-enable  INFO   [main] openjpa.jdbc.JDBC - Using dictionary class "org.apache.openjpa.jdbc.sql.DerbyDictionary".
2  cache-mode-enable  INFO   [main] openjpa.Runtime - Starting OpenJPA 2.3.1-SNAPSHOT
5  cache-mode-enable  INFO   [main] openjpa.jdbc.JDBC - Connected to Apache Derby version 10.10 using JDBC driver Apache Derby Embedded JDBC Driver version 10.8.2.2 - (1181258).
1  cache-mode-enable  WARN   [main] openjpa.DataCache - You have specified the openjpa.DataCache property "ExcludeTypes", but using that property is not recommended. Use the JPA 2.0 shared-cache-mode element "DISABLE_SELECTIVE" in conjunction with the javax.persistence.Cacheable annotation instead.
1  cache-mode-enable  INFO   [main] openjpa.jdbc.JDBC - Using dictionary class "org.apache.openjpa.jdbc.sql.DerbyDictionary".
2  cache-mode-enable  INFO   [main] openjpa.Runtime - Starting OpenJPA 2.3.1-SNAPSHOT
4  cache-mode-enable  INFO   [main] openjpa.jdbc.JDBC - Connected to Apache Derby version 10.10 using JDBC driver Apache Derby Embedded JDBC Driver version 10.8.2.2 - (1181258).
1  cache-mode-enable  WARN   [main] openjpa.DataCache - You have specified the openjpa.DataCache property "ExcludeTypes", but using that property is not recommended. Use the JPA 2.0 shared-cache-mode element "DISABLE_SELECTIVE" in conjunction with the javax.persistence.Cacheable annotation instead.
2  cache-mode-enable  INFO   [main] openjpa.jdbc.JDBC - Using dictionary class "org.apache.openjpa.jdbc.sql.DerbyDictionary".
4  cache-mode-enable  INFO   [main] openjpa.Runtime - Starting OpenJPA 2.3.1-SNAPSHOT
8  cache-mode-enable  INFO   [main] openjpa.jdbc.JDBC - Connected to Apache Derby version 10.10 using JDBC driver Apache Derby Embedded JDBC Driver version 10.8.2.2 - (1181258).
0  cache-mode-enable  WARN   [main] openjpa.DataCache - You have specified the openjpa.DataCache property "ExcludeTypes", but using that property is not recommended. Use the JPA 2.0 shared-cache-mode element "DISABLE_SELECTIVE" in conjunction with the javax.persistence.Cacheable annotation instead.
0  cache-mode-enable  INFO   [main] openjpa.jdbc.JDBC - Using dictionary class "org.apache.openjpa.jdbc.sql.DerbyDictionary".
1  cache-mode-enable  INFO   [main] openjpa.Runtime - Starting OpenJPA 2.3.1-SNAPSHOT
3  cache-mode-enable  INFO   [main] openjpa.jdbc.JDBC - Connected to Apache Derby version 10.10 using JDBC driver Apache Derby Embedded JDBC Driver version 10.8.2.2 - (1181258).
0  cache-mode-enable  WARN   [main] openjpa.DataCache - You have specified the openjpa.DataCache property "ExcludeTypes", but using that property is not recommended. Use the JPA 2.0 shared-cache-mode element "DISABLE_SELECTIVE" in conjunction with the javax.persistence.Cacheable annotation instead.
1  cache-mode-enable  INFO   [main] openjpa.jdbc.JDBC - Using dictionary class "org.apache.openjpa.jdbc.sql.DerbyDictionary".
1  cache-mode-enable  INFO   [main] openjpa.Runtime - Starting OpenJPA 2.3.1-SNAPSHOT
3  cache-mode-enable  INFO   [main] openjpa.jdbc.JDBC - Connected to Apache Derby version 10.10 using JDBC driver Apache Derby Embedded JDBC Driver version 10.8.2.2 - (1181258).
Tests run: 16, Failures: 0, Errors: 0, Skipped: 0, Time elapsed: 1.042 sec
Running org.apache.openjpa.persistence.arrays.TestXMLExceptionEntity
0  arrays  INFO   [main] openjpa.Runtime - Starting OpenJPA 2.3.1-SNAPSHOT
1  arrays  INFO   [main] openjpa.jdbc.JDBC - Using dictionary class "org.apache.openjpa.jdbc.sql.DerbyDictionary".
3  arrays  INFO   [main] openjpa.jdbc.JDBC - Connected to Apache Derby version 10.10 using JDBC driver Apache Derby Embedded JDBC Driver version 10.8.2.2 - (1181258).
1  arrays  INFO   [main] openjpa.Runtime - Starting OpenJPA 2.3.1-SNAPSHOT
1  arrays  INFO   [main] openjpa.jdbc.JDBC - Using dictionary class "org.apache.openjpa.jdbc.sql.DerbyDictionary".
4  arrays  INFO   [main] openjpa.jdbc.JDBC - Connected to Apache Derby version 10.10 using JDBC driver Apache Derby Embedded JDBC Driver version 10.8.2.2 - (1181258).
1  arrays  INFO   [main] openjpa.Runtime - Starting OpenJPA 2.3.1-SNAPSHOT
1  arrays  INFO   [main] openjpa.jdbc.JDBC - Using dictionary class "org.apache.openjpa.jdbc.sql.DerbyDictionary".
3  arrays  INFO   [main] openjpa.jdbc.JDBC - Connected to Apache Derby version 10.10 using JDBC driver Apache Derby Embedded JDBC Driver version 10.8.2.2 - (1181258).
Tests run: 3, Failures: 0, Errors: 0, Skipped: 0, Time elapsed: 0.094 sec
Running org.apache.openjpa.persistence.inheritance.TestDefaultInheritanceStrategy
0  test  INFO   [main] openjpa.Runtime - Starting OpenJPA 2.3.1-SNAPSHOT
0  test  INFO   [main] openjpa.jdbc.JDBC - Using dictionary class "org.apache.openjpa.jdbc.sql.DerbyDictionary".
3  test  INFO   [main] openjpa.jdbc.JDBC - Connected to Apache Derby version 10.10 using JDBC driver Apache Derby Embedded JDBC Driver version 10.8.2.2 - (1181258).
0  test  INFO   [main] openjpa.Runtime - Starting OpenJPA 2.3.1-SNAPSHOT
0  test  INFO   [main] openjpa.jdbc.JDBC - Using dictionary class "org.apache.openjpa.jdbc.sql.DerbyDictionary".
4  test  INFO   [main] openjpa.jdbc.JDBC - Connected to Apache Derby version 10.10 using JDBC driver Apache Derby Embedded JDBC Driver version 10.8.2.2 - (1181258).
0  test  INFO   [main] openjpa.Runtime - Starting OpenJPA 2.3.1-SNAPSHOT
0  test  INFO   [main] openjpa.jdbc.JDBC - Using dictionary class "org.apache.openjpa.jdbc.sql.DerbyDictionary".
3  test  INFO   [main] openjpa.jdbc.JDBC - Connected to Apache Derby version 10.10 using JDBC driver Apache Derby Embedded JDBC Driver version 10.8.2.2 - (1181258).
0  test  INFO   [main] openjpa.Runtime - Starting OpenJPA 2.3.1-SNAPSHOT
0  test  INFO   [main] openjpa.jdbc.JDBC - Using dictionary class "org.apache.openjpa.jdbc.sql.DerbyDictionary".
4  test  INFO   [main] openjpa.jdbc.JDBC - Connected to Apache Derby version 10.10 using JDBC driver Apache Derby Embedded JDBC Driver version 10.8.2.2 - (1181258).
0  test  INFO   [main] openjpa.Runtime - Starting OpenJPA 2.3.1-SNAPSHOT
0  test  INFO   [main] openjpa.jdbc.JDBC - Using dictionary class "org.apache.openjpa.jdbc.sql.DerbyDictionary".
3  test  INFO   [main] openjpa.jdbc.JDBC - Connected to Apache Derby version 10.10 using JDBC driver Apache Derby Embedded JDBC Driver version 10.8.2.2 - (1181258).
1  test  INFO   [main] openjpa.Runtime - Starting OpenJPA 2.3.1-SNAPSHOT
1  test  INFO   [main] openjpa.jdbc.JDBC - Using dictionary class "org.apache.openjpa.jdbc.sql.DerbyDictionary".
4  test  INFO   [main] openjpa.jdbc.JDBC - Connected to Apache Derby version 10.10 using JDBC driver Apache Derby Embedded JDBC Driver version 10.8.2.2 - (1181258).
1  test  INFO   [main] openjpa.Runtime - Starting OpenJPA 2.3.1-SNAPSHOT
1  test  INFO   [main] openjpa.jdbc.JDBC - Using dictionary class "org.apache.openjpa.jdbc.sql.DerbyDictionary".
4  test  INFO   [main] openjpa.jdbc.JDBC - Connected to Apache Derby version 10.10 using JDBC driver Apache Derby Embedded JDBC Driver version 10.8.2.2 - (1181258).
1  test  INFO   [main] openjpa.Runtime - Starting OpenJPA 2.3.1-SNAPSHOT
1  test  INFO   [main] openjpa.jdbc.JDBC - Using dictionary class "org.apache.openjpa.jdbc.sql.DerbyDictionary".
4  test  INFO   [main] openjpa.jdbc.JDBC - Connected to Apache Derby version 10.10 using JDBC driver Apache Derby Embedded JDBC Driver version 10.8.2.2 - (1181258).
1  test  INFO   [main] openjpa.Runtime - Starting OpenJPA 2.3.1-SNAPSHOT
1  test  INFO   [main] openjpa.jdbc.JDBC - Using dictionary class "org.apache.openjpa.jdbc.sql.DerbyDictionary".
4  test  INFO   [main] openjpa.jdbc.JDBC - Connected to Apache Derby version 10.10 using JDBC driver Apache Derby Embedded JDBC Driver version 10.8.2.2 - (1181258).
0  test  INFO   [main] openjpa.Runtime - Starting OpenJPA 2.3.1-SNAPSHOT
1  test  INFO   [main] openjpa.jdbc.JDBC - Using dictionary class "org.apache.openjpa.jdbc.sql.DerbyDictionary".
4  test  INFO   [main] openjpa.jdbc.JDBC - Connected to Apache Derby version 10.10 using JDBC driver Apache Derby Embedded JDBC Driver version 10.8.2.2 - (1181258).
Tests run: 10, Failures: 0, Errors: 0, Skipped: 0, Time elapsed: 0.979 sec
Running org.apache.openjpa.persistence.detachment.TestDetachNoStateField
0  test  INFO   [main] openjpa.Runtime - Starting OpenJPA 2.3.1-SNAPSHOT
1  test  INFO   [main] openjpa.jdbc.JDBC - Using dictionary class "org.apache.openjpa.jdbc.sql.DerbyDictionary".
3  test  INFO   [main] openjpa.jdbc.JDBC - Connected to Apache Derby version 10.10 using JDBC driver Apache Derby Embedded JDBC Driver version 10.8.2.2 - (1181258).
0  test  INFO   [main] openjpa.Runtime - Starting OpenJPA 2.3.1-SNAPSHOT
0  test  INFO   [main] openjpa.jdbc.JDBC - Using dictionary class "org.apache.openjpa.jdbc.sql.DerbyDictionary".
3  test  INFO   [main] openjpa.jdbc.JDBC - Connected to Apache Derby version 10.10 using JDBC driver Apache Derby Embedded JDBC Driver version 10.8.2.2 - (1181258).
1  test  INFO   [main] openjpa.Runtime - Starting OpenJPA 2.3.1-SNAPSHOT
1  test  INFO   [main] openjpa.jdbc.JDBC - Using dictionary class "org.apache.openjpa.jdbc.sql.DerbyDictionary".
4  test  INFO   [main] openjpa.jdbc.JDBC - Connected to Apache Derby version 10.10 using JDBC driver Apache Derby Embedded JDBC Driver version 10.8.2.2 - (1181258).
Tests run: 3, Failures: 0, Errors: 0, Skipped: 0, Time elapsed: 0.221 sec
Running org.apache.openjpa.persistence.detachment.TestAttachConstructedCopy
1  test  INFO   [main] openjpa.Runtime - Starting OpenJPA 2.3.1-SNAPSHOT
1  test  INFO   [main] openjpa.jdbc.JDBC - Using dictionary class "org.apache.openjpa.jdbc.sql.DerbyDictionary".
4  test  INFO   [main] openjpa.jdbc.JDBC - Connected to Apache Derby version 10.10 using JDBC driver Apache Derby Embedded JDBC Driver version 10.8.2.2 - (1181258).
Tests run: 1, Failures: 0, Errors: 0, Skipped: 0, Time elapsed: 0.035 sec
Running org.apache.openjpa.persistence.TestOpenjpaIdNotRecognizedMessage
0  test  INFO   [main] openjpa.Runtime - Starting OpenJPA 2.3.1-SNAPSHOT
1  test  INFO   [main] openjpa.jdbc.JDBC - Using dictionary class "org.apache.openjpa.jdbc.sql.DerbyDictionary".
5  test  INFO   [main] openjpa.jdbc.JDBC - Connected to Apache Derby version 10.10 using JDBC driver Apache Derby Embedded JDBC Driver version 10.8.2.2 - (1181258).
Tests run: 1, Failures: 0, Errors: 0, Skipped: 0, Time elapsed: 0.029 sec
Running org.apache.openjpa.persistence.fields.TestEnumSets
0  test  INFO   [main] openjpa.Runtime - Starting OpenJPA 2.3.1-SNAPSHOT
1  test  INFO   [main] openjpa.jdbc.JDBC - Using dictionary class "org.apache.openjpa.jdbc.sql.DerbyDictionary".
4  test  INFO   [main] openjpa.jdbc.JDBC - Connected to Apache Derby version 10.10 using JDBC driver Apache Derby Embedded JDBC Driver version 10.8.2.2 - (1181258).
Tests run: 1, Failures: 0, Errors: 0, Skipped: 0, Time elapsed: 0.035 sec
Running org.apache.openjpa.persistence.annotations.TestOneToOne
1  TestConv  INFO   [main] openjpa.Runtime - Starting OpenJPA 2.3.1-SNAPSHOT
1  TestConv  INFO   [main] openjpa.jdbc.JDBC - Using dictionary class "org.apache.openjpa.jdbc.sql.DerbyDictionary".
4  TestConv  INFO   [main] openjpa.jdbc.JDBC - Connected to Apache Derby version 10.10 using JDBC driver Apache Derby Embedded JDBC Driver version 10.8.2.2 - (1181258).
13  TestConv  WARN   [main] openjpa.MetaData - The composite identity class "class org.apache.openjpa.persistence.annotations.common.apps.annotApp.annotype.AnnoTest2$Oid" for entity "class org.apache.openjpa.persistence.annotations.common.apps.annotApp.annotype.AnnoTest2" is not serializable.
17  TestConv  WARN   [main] openjpa.MetaData - The composite identity class "class org.apache.openjpa.persistence.annotations.common.apps.annotApp.annotype.Generator$Oid" for entity "class org.apache.openjpa.persistence.annotations.common.apps.annotApp.annotype.Generator" is not serializable.
183  TestConv  WARN   [main] openjpa.MetaData - The composite identity class "class org.apache.openjpa.persistence.annotations.common.apps.annotApp.annotype.AnnoTest2$Oid" for entity "class org.apache.openjpa.persistence.annotations.common.apps.annotApp.annotype.AnnoTest2" is not serializable.
0  TestConv  INFO   [main] openjpa.Runtime - Starting OpenJPA 2.3.1-SNAPSHOT
0  TestConv  INFO   [main] openjpa.jdbc.JDBC - Using dictionary class "org.apache.openjpa.jdbc.sql.DerbyDictionary".
3  TestConv  INFO   [main] openjpa.jdbc.JDBC - Connected to Apache Derby version 10.10 using JDBC driver Apache Derby Embedded JDBC Driver version 10.8.2.2 - (1181258).
11  TestConv  WARN   [main] openjpa.MetaData - The composite identity class "class org.apache.openjpa.persistence.annotations.common.apps.annotApp.annotype.AnnoTest2$Oid" for entity "class org.apache.openjpa.persistence.annotations.common.apps.annotApp.annotype.AnnoTest2" is not serializable.
15  TestConv  WARN   [main] openjpa.MetaData - The composite identity class "class org.apache.openjpa.persistence.annotations.common.apps.annotApp.annotype.Generator$Oid" for entity "class org.apache.openjpa.persistence.annotations.common.apps.annotApp.annotype.Generator" is not serializable.
89  TestConv  WARN   [main] openjpa.MetaData - The composite identity class "class org.apache.openjpa.persistence.annotations.common.apps.annotApp.annotype.AnnoTest2$Oid" for entity "class org.apache.openjpa.persistence.annotations.common.apps.annotApp.annotype.AnnoTest2" is not serializable.
0  TestConv  INFO   [main] openjpa.Runtime - Starting OpenJPA 2.3.1-SNAPSHOT
0  TestConv  INFO   [main] openjpa.jdbc.JDBC - Using dictionary class "org.apache.openjpa.jdbc.sql.DerbyDictionary".
3  TestConv  INFO   [main] openjpa.jdbc.JDBC - Connected to Apache Derby version 10.10 using JDBC driver Apache Derby Embedded JDBC Driver version 10.8.2.2 - (1181258).
11  TestConv  WARN   [main] openjpa.MetaData - The composite identity class "class org.apache.openjpa.persistence.annotations.common.apps.annotApp.annotype.AnnoTest2$Oid" for entity "class org.apache.openjpa.persistence.annotations.common.apps.annotApp.annotype.AnnoTest2" is not serializable.
91  TestConv  WARN   [main] openjpa.MetaData - The composite identity class "class org.apache.openjpa.persistence.annotations.common.apps.annotApp.annotype.Generator$Oid" for entity "class org.apache.openjpa.persistence.annotations.common.apps.annotApp.annotype.Generator" is not serializable.
139  TestConv  WARN   [main] openjpa.MetaData - The composite identity class "class org.apache.openjpa.persistence.annotations.common.apps.annotApp.annotype.AnnoTest2$Oid" for entity "class org.apache.openjpa.persistence.annotations.common.apps.annotApp.annotype.AnnoTest2" is not serializable.
1  TestConv  INFO   [main] openjpa.Runtime - Starting OpenJPA 2.3.1-SNAPSHOT
1  TestConv  INFO   [main] openjpa.jdbc.JDBC - Using dictionary class "org.apache.openjpa.jdbc.sql.DerbyDictionary".
4  TestConv  INFO   [main] openjpa.jdbc.JDBC - Connected to Apache Derby version 10.10 using JDBC driver Apache Derby Embedded JDBC Driver version 10.8.2.2 - (1181258).
11  TestConv  WARN   [main] openjpa.MetaData - The composite identity class "class org.apache.openjpa.persistence.annotations.common.apps.annotApp.annotype.AnnoTest2$Oid" for entity "class org.apache.openjpa.persistence.annotations.common.apps.annotApp.annotype.AnnoTest2" is not serializable.
14  TestConv  WARN   [main] openjpa.MetaData - The composite identity class "class org.apache.openjpa.persistence.annotations.common.apps.annotApp.annotype.Generator$Oid" for entity "class org.apache.openjpa.persistence.annotations.common.apps.annotApp.annotype.Generator" is not serializable.
61  TestConv  WARN   [main] openjpa.MetaData - The composite identity class "class org.apache.openjpa.persistence.annotations.common.apps.annotApp.annotype.AnnoTest2$Oid" for entity "class org.apache.openjpa.persistence.annotations.common.apps.annotApp.annotype.AnnoTest2" is not serializable.
1  TestConv  INFO   [main] openjpa.Runtime - Starting OpenJPA 2.3.1-SNAPSHOT
1  TestConv  INFO   [main] openjpa.jdbc.JDBC - Using dictionary class "org.apache.openjpa.jdbc.sql.DerbyDictionary".
4  TestConv  INFO   [main] openjpa.jdbc.JDBC - Connected to Apache Derby version 10.10 using JDBC driver Apache Derby Embedded JDBC Driver version 10.8.2.2 - (1181258).
10  TestConv  WARN   [main] openjpa.MetaData - The composite identity class "class org.apache.openjpa.persistence.annotations.common.apps.annotApp.annotype.AnnoTest2$Oid" for entity "class org.apache.openjpa.persistence.annotations.common.apps.annotApp.annotype.AnnoTest2" is not serializable.
14  TestConv  WARN   [main] openjpa.MetaData - The composite identity class "class org.apache.openjpa.persistence.annotations.common.apps.annotApp.annotype.Generator$Oid" for entity "class org.apache.openjpa.persistence.annotations.common.apps.annotApp.annotype.Generator" is not serializable.
61  TestConv  WARN   [main] openjpa.MetaData - The composite identity class "class org.apache.openjpa.persistence.annotations.common.apps.annotApp.annotype.AnnoTest2$Oid" for entity "class org.apache.openjpa.persistence.annotations.common.apps.annotApp.annotype.AnnoTest2" is not serializable.
Tests run: 5, Failures: 0, Errors: 0, Skipped: 0, Time elapsed: 0.628 sec
Running org.apache.openjpa.persistence.generationtype.TestMultipleSchemaNames
0  test  INFO   [main] openjpa.jdbc.JDBC - Using dictionary class "org.apache.openjpa.jdbc.sql.DerbyDictionary".
0  test  INFO   [main] openjpa.jdbc.JDBC - Using dictionary class "org.apache.openjpa.jdbc.sql.DerbyDictionary".
0  test  INFO   [main] openjpa.Runtime - Starting OpenJPA 2.3.1-SNAPSHOT
0  test  INFO   [main] openjpa.jdbc.JDBC - Using dictionary class "org.apache.openjpa.jdbc.sql.DerbyDictionary".
3  test  INFO   [main] openjpa.jdbc.JDBC - Connected to Apache Derby version 10.10 using JDBC driver Apache Derby Embedded JDBC Driver version 10.8.2.2 - (1181258).
0  test  INFO   [main] openjpa.jdbc.JDBC - Using dictionary class "org.apache.openjpa.jdbc.sql.DerbyDictionary".
0  test  INFO   [main] openjpa.Runtime - Starting OpenJPA 2.3.1-SNAPSHOT
1  test  INFO   [main] openjpa.jdbc.JDBC - Using dictionary class "org.apache.openjpa.jdbc.sql.DerbyDictionary".
3  test  INFO   [main] openjpa.jdbc.JDBC - Connected to Apache Derby version 10.10 using JDBC driver Apache Derby Embedded JDBC Driver version 10.8.2.2 - (1181258).
1  test  INFO   [main] openjpa.jdbc.JDBC - Using dictionary class "org.apache.openjpa.jdbc.sql.DerbyDictionary".
0  test  INFO   [main] openjpa.Runtime - Starting OpenJPA 2.3.1-SNAPSHOT
0  test  INFO   [main] openjpa.jdbc.JDBC - Using dictionary class "org.apache.openjpa.jdbc.sql.DerbyDictionary".
3  test  INFO   [main] openjpa.jdbc.JDBC - Connected to Apache Derby version 10.10 using JDBC driver Apache Derby Embedded JDBC Driver version 10.8.2.2 - (1181258).
Tests run: 3, Failures: 0, Errors: 0, Skipped: 0, Time elapsed: 0.388 sec
Running org.apache.openjpa.persistence.kernel.TestEJBEntityManager
0  test  INFO   [main] openjpa.Runtime - Starting OpenJPA 2.3.1-SNAPSHOT
0  test  INFO   [main] openjpa.jdbc.JDBC - Using dictionary class "org.apache.openjpa.jdbc.sql.DerbyDictionary".
3  test  INFO   [main] openjpa.jdbc.JDBC - Connected to Apache Derby version 10.10 using JDBC driver Apache Derby Embedded JDBC Driver version 10.8.2.2 - (1181258).
0  test  INFO   [main] openjpa.Runtime - Starting OpenJPA 2.3.1-SNAPSHOT
1  test  INFO   [main] openjpa.jdbc.JDBC - Using dictionary class "org.apache.openjpa.jdbc.sql.DerbyDictionary".
7  test  INFO   [main] openjpa.jdbc.JDBC - Connected to Apache Derby version 10.10 using JDBC driver Apache Derby Embedded JDBC Driver version 10.8.2.2 - (1181258).
Tests run: 2, Failures: 0, Errors: 0, Skipped: 0, Time elapsed: 0.069 sec
Running org.apache.openjpa.persistence.query.TestQueryResultClassAPI
1  test  INFO   [main] openjpa.Runtime - Starting OpenJPA 2.3.1-SNAPSHOT
1  test  INFO   [main] openjpa.jdbc.JDBC - Using dictionary class "org.apache.openjpa.jdbc.sql.DerbyDictionary".
5  test  INFO   [main] openjpa.jdbc.JDBC - Connected to Apache Derby version 10.10 using JDBC driver Apache Derby Embedded JDBC Driver version 10.8.2.2 - (1181258).
Tests run: 1, Failures: 0, Errors: 0, Skipped: 0, Time elapsed: 0.119 sec
Running org.apache.openjpa.persistence.query.TestProjectionQueryWithIdenticalResult
0  test  INFO   [main] openjpa.Runtime - Starting OpenJPA 2.3.1-SNAPSHOT
0  test  INFO   [main] openjpa.jdbc.JDBC - Using dictionary class "org.apache.openjpa.jdbc.sql.DerbyDictionary".
3  test  INFO   [main] openjpa.jdbc.JDBC - Connected to Apache Derby version 10.10 using JDBC driver Apache Derby Embedded JDBC Driver version 10.8.2.2 - (1181258).
0  test  INFO   [main] openjpa.Runtime - Starting OpenJPA 2.3.1-SNAPSHOT
0  test  INFO   [main] openjpa.jdbc.JDBC - Using dictionary class "org.apache.openjpa.jdbc.sql.DerbyDictionary".
3  test  INFO   [main] openjpa.jdbc.JDBC - Connected to Apache Derby version 10.10 using JDBC driver Apache Derby Embedded JDBC Driver version 10.8.2.2 - (1181258).
0  test  INFO   [main] openjpa.Runtime - Starting OpenJPA 2.3.1-SNAPSHOT
0  test  INFO   [main] openjpa.jdbc.JDBC - Using dictionary class "org.apache.openjpa.jdbc.sql.DerbyDictionary".
3  test  INFO   [main] openjpa.jdbc.JDBC - Connected to Apache Derby version 10.10 using JDBC driver Apache Derby Embedded JDBC Driver version 10.8.2.2 - (1181258).
0  test  INFO   [main] openjpa.Runtime - Starting OpenJPA 2.3.1-SNAPSHOT
0  test  INFO   [main] openjpa.jdbc.JDBC - Using dictionary class "org.apache.openjpa.jdbc.sql.DerbyDictionary".
3  test  INFO   [main] openjpa.jdbc.JDBC - Connected to Apache Derby version 10.10 using JDBC driver Apache Derby Embedded JDBC Driver version 10.8.2.2 - (1181258).
Tests run: 4, Failures: 0, Errors: 0, Skipped: 0, Time elapsed: 0.207 sec
Running org.apache.openjpa.persistence.identity.TestBooleanId
1  test  INFO   [main] openjpa.Runtime - Starting OpenJPA 2.3.1-SNAPSHOT
1  test  INFO   [main] openjpa.jdbc.JDBC - Using dictionary class "org.apache.openjpa.jdbc.sql.DerbyDictionary".
4  test  INFO   [main] openjpa.jdbc.JDBC - Connected to Apache Derby version 10.10 using JDBC driver Apache Derby Embedded JDBC Driver version 10.8.2.2 - (1181258).
5  test  WARN   [main] openjpa.MetaData - The composite identity class "class org.apache.openjpa.persistence.identity.CompoundBooleanId" for entity "class org.apache.openjpa.persistence.identity.CompoundBooleanIdEntity" is not serializable.
0  test  INFO   [main] openjpa.Runtime - Starting OpenJPA 2.3.1-SNAPSHOT
1  test  INFO   [main] openjpa.jdbc.JDBC - Using dictionary class "org.apache.openjpa.jdbc.sql.DerbyDictionary".
5  test  INFO   [main] openjpa.jdbc.JDBC - Connected to Apache Derby version 10.10 using JDBC driver Apache Derby Embedded JDBC Driver version 10.8.2.2 - (1181258).
5  test  WARN   [main] openjpa.MetaData - The composite identity class "class org.apache.openjpa.persistence.identity.CompoundBooleanId" for entity "class org.apache.openjpa.persistence.identity.CompoundBooleanIdEntity" is not serializable.
47  test  WARN   [main] openjpa.MetaData - The composite identity class "class org.apache.openjpa.persistence.identity.CompoundBooleanId" for entity "class org.apache.openjpa.persistence.identity.CompoundBooleanIdEntity" is not serializable.
Tests run: 2, Failures: 0, Errors: 0, Skipped: 0, Time elapsed: 0.11 sec
Running org.apache.openjpa.persistence.dynamicschema.TestResWordEntity
1  test  INFO   [main] openjpa.Runtime - Starting OpenJPA 2.3.1-SNAPSHOT
1  test  INFO   [main] openjpa.jdbc.JDBC - Using dictionary class "org.apache.openjpa.jdbc.sql.DerbyDictionary".
4  test  INFO   [main] openjpa.jdbc.JDBC - Connected to Apache Derby version 10.10 using JDBC driver Apache Derby Embedded JDBC Driver version 10.8.2.2 - (1181258).
0  test  INFO   [main] openjpa.Runtime - Starting OpenJPA 2.3.1-SNAPSHOT
0  test  INFO   [main] openjpa.jdbc.JDBC - Using dictionary class "org.apache.openjpa.jdbc.sql.DerbyDictionary".
4  test  INFO   [main] openjpa.jdbc.JDBC - Connected to Apache Derby version 10.10 using JDBC driver Apache Derby Embedded JDBC Driver version 10.8.2.2 - (1181258).
0  test  INFO   [main] openjpa.Runtime - Starting OpenJPA 2.3.1-SNAPSHOT
0  test  INFO   [main] openjpa.jdbc.JDBC - Using dictionary class "org.apache.openjpa.jdbc.sql.DerbyDictionary".
3  test  INFO   [main] openjpa.jdbc.JDBC - Connected to Apache Derby version 10.10 using JDBC driver Apache Derby Embedded JDBC Driver version 10.8.2.2 - (1181258).
0  test  INFO   [main] openjpa.Runtime - Starting OpenJPA 2.3.1-SNAPSHOT
0  test  INFO   [main] openjpa.jdbc.JDBC - Using dictionary class "org.apache.openjpa.jdbc.sql.DerbyDictionary".
3  test  INFO   [main] openjpa.jdbc.JDBC - Connected to Apache Derby version 10.10 using JDBC driver Apache Derby Embedded JDBC Driver version 10.8.2.2 - (1181258).
Tests run: 4, Failures: 0, Errors: 0, Skipped: 0, Time elapsed: 0.078 sec
Running org.apache.openjpa.persistence.kernel.TestEJBNullValues
0  test  INFO   [main] openjpa.Runtime - Starting OpenJPA 2.3.1-SNAPSHOT
1  test  INFO   [main] openjpa.jdbc.JDBC - Using dictionary class "org.apache.openjpa.jdbc.sql.DerbyDictionary".
3  test  INFO   [main] openjpa.jdbc.JDBC - Connected to Apache Derby version 10.10 using JDBC driver Apache Derby Embedded JDBC Driver version 10.8.2.2 - (1181258).
Tests run: 1, Failures: 0, Errors: 0, Skipped: 0, Time elapsed: 0.027 sec
Running org.apache.openjpa.persistence.models.company.joined.TestJoinedCompanyModel
1  test  INFO   [main] openjpa.Runtime - Starting OpenJPA 2.3.1-SNAPSHOT
1  test  INFO   [main] openjpa.jdbc.JDBC - Using dictionary class "org.apache.openjpa.jdbc.sql.DerbyDictionary".
3  test  INFO   [main] openjpa.jdbc.JDBC - Connected to Apache Derby version 10.10 using JDBC driver Apache Derby Embedded JDBC Driver version 10.8.2.2 - (1181258).
Tests run: 1, Failures: 0, Errors: 0, Skipped: 0, Time elapsed: 7.346 sec

Results :

Failed tests:
  testMappingCorrectID(org.apache.openjpa.persistence.query.sqlresultmapping.TestSQLResultSetMapping)

Tests in error:
  testMappingNoException(org.apache.openjpa.persistence.query.sqlresultmapping.TestSQLResultSetMapping)

Tests run: 3049, Failures: 1, Errors: 1, Skipped: 0

[INFO] ------------------------------------------------------------------------
[ERROR] BUILD FAILURE
[INFO] ------------------------------------------------------------------------
[INFO] There are test failures.

Please refer to <https://builds.apache.org/job/OpenJPA-2.3.x/ws/openjpa-persistence-jdbc/target/surefire-reports> for the individual test results.
[INFO] ------------------------------------------------------------------------
[INFO] For more information, run Maven with the -e switch
[INFO] ------------------------------------------------------------------------
[INFO] Total time: 12 minutes 38 seconds
[INFO] Finished at: Wed Jul 19 14:50:25 UTC 2017
[INFO] Final Memory: 214M/8925M
[INFO] ------------------------------------------------------------------------
Build step 'Execute shell' marked build as failure
Archiving artifacts
Setting ANT_1_9_7_HOME=/home/jenkins/tools/ant/apache-ant-1.9.7
Setting JDK_1_6_LATEST__HOME=/home/jenkins/tools/java/latest1.6
Setting MAVEN_2_2_1_HOME=/home/jenkins/tools/maven/apache-maven-2.2.1
Recording test results
Setting ANT_1_9_7_HOME=/home/jenkins/tools/ant/apache-ant-1.9.7
Setting JDK_1_6_LATEST__HOME=/home/jenkins/tools/java/latest1.6
Setting MAVEN_2_2_1_HOME=/home/jenkins/tools/maven/apache-maven-2.2.1
Setting ANT_1_9_7_HOME=/home/jenkins/tools/ant/apache-ant-1.9.7
Setting JDK_1_6_LATEST__HOME=/home/jenkins/tools/java/latest1.6
Setting MAVEN_2_2_1_HOME=/home/jenkins/tools/maven/apache-maven-2.2.1
Loading...