Build failed in Jenkins: OpenJPA-2.4.x #1

classic Classic list List threaded Threaded
6 messages Options
Reply | Threaded
Open this post in threaded view
|  
Report Content as Inappropriate

Build failed in Jenkins: OpenJPA-2.4.x #1

Apache Jenkins Server-2
See <https://builds.apache.org/job/OpenJPA-2.4.x/1/display/redirect>

------------------------------------------
[...truncated 5.08 MB...]
[INFO] Installing <https://builds.apache.org/job/OpenJPA-2.4.x/1/artifact/openjpa-all/target/openjpa-all-2.4.3-SNAPSHOT-tests.jar> to /home/jenkins/.m2/repository/org/apache/openjpa/openjpa-all/2.4.3-SNAPSHOT/openjpa-all-2.4.3-SNAPSHOT-tests.jar
[INFO]                                                                        
[INFO] ------------------------------------------------------------------------
[INFO] Building OpenJPA Project Docs and Assemblies 2.4.3-SNAPSHOT
[INFO] ------------------------------------------------------------------------
[INFO]
[INFO] --- maven-clean-plugin:2.5:clean (default-clean) @ apache-openjpa ---
[INFO]
[INFO] --- buildnumber-maven-plugin:1.4:create (default) @ apache-openjpa ---
[INFO]
[INFO] --- maven-enforcer-plugin:1.3.1:enforce (default) @ apache-openjpa ---
[INFO]
[INFO] --- maven-checkstyle-plugin:2.9:checkstyle (default) @ apache-openjpa ---
[INFO]
[INFO] --- maven-remote-resources-plugin:1.5:process (default) @ apache-openjpa ---
[INFO]
[INFO] --- maven-compiler-plugin:3.5.1:testCompile (test-source-compile) @ apache-openjpa ---
[INFO] No sources to compile
[INFO]
[INFO] --- maven-assembly-plugin:2.6:attached (bin) @ apache-openjpa ---
[INFO] Reading assembly descriptor: assembly.xml
[INFO] Reading assembly descriptor: source-assembly.xml
[INFO] Reading assembly descriptor: bin-assembly.xml
[WARNING] The assembly descriptor contains a filesystem-root relative reference, which is not cross platform compatible /
[WARNING] Cannot include project artifact: org.apache.openjpa:apache-openjpa:pom:2.4.3-SNAPSHOT; it doesn't have an associated file or directory.
[WARNING] Cannot include project artifact: org.apache.openjpa:apache-openjpa:pom:2.4.3-SNAPSHOT; it doesn't have an associated file or directory.
[INFO] Building zip: <https://builds.apache.org/job/OpenJPA-2.4.x/ws/openjpa-project/target/site/downloads/apache-openjpa-2.4.3-SNAPSHOT-binary.zip>
[INFO] Building zip: <https://builds.apache.org/job/OpenJPA-2.4.x/ws/openjpa-project/target/site/downloads/apache-openjpa-2.4.3-SNAPSHOT-source.zip>
[WARNING] The assembly descriptor contains a filesystem-root relative reference, which is not cross platform compatible /
[WARNING] Cannot include project artifact: org.apache.openjpa:apache-openjpa:pom:2.4.3-SNAPSHOT; it doesn't have an associated file or directory.
[WARNING] Cannot include project artifact: org.apache.openjpa:apache-openjpa:pom:2.4.3-SNAPSHOT; it doesn't have an associated file or directory.
[INFO] Building zip: <https://builds.apache.org/job/OpenJPA-2.4.x/ws/openjpa-project/target/site/downloads/apache-openjpa-2.4.3-SNAPSHOT-binary-nodocs.zip>
[INFO]
[INFO] --- maven-site-plugin:3.4:attach-descriptor (attach-descriptor) @ apache-openjpa ---
[INFO]
[INFO] --- ianal-maven-plugin:1.0-alpha-1:verify-legal-files (default) @ apache-openjpa ---
[INFO] Checking legal files in: apache-openjpa-2.4.3-SNAPSHOT-binary.zip
[INFO] Checking legal files in: apache-openjpa-2.4.3-SNAPSHOT-source.zip
[WARNING] Artifact does not contain any legal files: apache-openjpa-2.4.3-SNAPSHOT-source.zip
[INFO] Checking legal files in: apache-openjpa-2.4.3-SNAPSHOT-binary-nodocs.zip
[INFO]
[INFO] --- apache-rat-plugin:0.11:check (default) @ apache-openjpa ---
[INFO] 51 implicit excludes (use -debug for more details).
[INFO] Exclude: **/.*/**
[INFO] Exclude: **/target/**/*
[INFO] 41 resources included (use -debug for more details)
[INFO] Rat check: Summary of files. Unapproved: 0 unknown: 0 generated: 0 approved: 41 licence.
[INFO]
[INFO] --- maven-install-plugin:2.5.2:install (default-install) @ apache-openjpa ---
[INFO] Installing <https://builds.apache.org/job/OpenJPA-2.4.x/ws/openjpa-project/pom.xml> to /home/jenkins/.m2/repository/org/apache/openjpa/apache-openjpa/2.4.3-SNAPSHOT/apache-openjpa-2.4.3-SNAPSHOT.pom
[INFO] Installing <https://builds.apache.org/job/OpenJPA-2.4.x/ws/openjpa-project/target/site/downloads/apache-openjpa-2.4.3-SNAPSHOT-binary.zip> to /home/jenkins/.m2/repository/org/apache/openjpa/apache-openjpa/2.4.3-SNAPSHOT/apache-openjpa-2.4.3-SNAPSHOT-binary.zip
[INFO] Installing <https://builds.apache.org/job/OpenJPA-2.4.x/ws/openjpa-project/target/site/downloads/apache-openjpa-2.4.3-SNAPSHOT-source.zip> to /home/jenkins/.m2/repository/org/apache/openjpa/apache-openjpa/2.4.3-SNAPSHOT/apache-openjpa-2.4.3-SNAPSHOT-source.zip
[INFO] Installing <https://builds.apache.org/job/OpenJPA-2.4.x/ws/openjpa-project/target/site/downloads/apache-openjpa-2.4.3-SNAPSHOT-binary-nodocs.zip> to /home/jenkins/.m2/repository/org/apache/openjpa/apache-openjpa/2.4.3-SNAPSHOT/apache-openjpa-2.4.3-SNAPSHOT-binary-nodocs.zip
[INFO]                                                                        
[INFO] ------------------------------------------------------------------------
[INFO] Building OpenJPA Examples 2.4.3-SNAPSHOT
[INFO] ------------------------------------------------------------------------
[INFO]
[INFO] --- maven-clean-plugin:2.5:clean (default-clean) @ openjpa-examples ---
[INFO]
[INFO] --- buildnumber-maven-plugin:1.4:create (default) @ openjpa-examples ---
[INFO]
[INFO] --- maven-enforcer-plugin:1.3.1:enforce (default) @ openjpa-examples ---
[INFO]
[INFO] --- maven-checkstyle-plugin:2.9:checkstyle (default) @ openjpa-examples ---
[INFO]
[INFO] --- maven-remote-resources-plugin:1.5:process (default) @ openjpa-examples ---
[INFO]
[INFO] --- maven-compiler-plugin:3.5.1:testCompile (test-source-compile) @ openjpa-examples ---
[INFO] No sources to compile
[INFO]
[INFO] --- maven-site-plugin:3.4:attach-descriptor (attach-descriptor) @ openjpa-examples ---
[INFO]
[INFO] --- ianal-maven-plugin:1.0-alpha-1:verify-legal-files (default) @ openjpa-examples ---
[INFO]
[INFO] --- apache-rat-plugin:0.11:check (default) @ openjpa-examples ---
[INFO] 51 implicit excludes (use -debug for more details).
[INFO] Exclude: **/.*/**
[INFO] Exclude: **/target/**/*
[INFO] 168 resources included (use -debug for more details)
[INFO] Rat check: Summary of files. Unapproved: 0 unknown: 0 generated: 0 approved: 167 licence.
[INFO]
[INFO] --- maven-install-plugin:2.5.2:install (default-install) @ openjpa-examples ---
[INFO] Installing <https://builds.apache.org/job/OpenJPA-2.4.x/ws/openjpa-examples/pom.xml> to /home/jenkins/.m2/repository/org/apache/openjpa/openjpa-examples/2.4.3-SNAPSHOT/openjpa-examples-2.4.3-SNAPSHOT.pom
[INFO]                                                                        
[INFO] ------------------------------------------------------------------------
[INFO] Building OpenJPA Examples - Simple 2.4.3-SNAPSHOT
[INFO] ------------------------------------------------------------------------
[INFO]
[INFO] --- maven-clean-plugin:2.5:clean (default-clean) @ simple ---
[INFO]
[INFO] --- buildnumber-maven-plugin:1.4:create (default) @ simple ---
[INFO]
[INFO] --- maven-enforcer-plugin:1.3.1:enforce (default) @ simple ---
[INFO]
[INFO] --- maven-checkstyle-plugin:2.9:checkstyle (default) @ simple ---
[INFO] Starting audit...
Audit done.

[WARNING] Unable to locate Source XRef to link to - DISABLED
[INFO]
[INFO] --- maven-remote-resources-plugin:1.5:process (default) @ simple ---
[INFO]
[INFO] --- maven-resources-plugin:2.7:resources (default-resources) @ simple ---
[INFO] Using 'UTF-8' encoding to copy filtered resources.
[INFO] skip non existing resourceDirectory <https://builds.apache.org/job/OpenJPA-2.4.x/ws/openjpa-examples/simple/src/main/resources>
[INFO] Copying 3 resources
[INFO]
[INFO] --- maven-compiler-plugin:3.5.1:compile (default-compile) @ simple ---
[INFO] Changes detected - recompiling the module!
[INFO] Compiling 12 source files to <https://builds.apache.org/job/OpenJPA-2.4.x/ws/openjpa-examples/simple/target/classes>
[INFO] Some input files use unchecked or unsafe operations.
[INFO] Recompile with -Xlint:unchecked for details.
[INFO]
[INFO] --- maven-compiler-plugin:3.5.1:testCompile (test-source-compile) @ simple ---
[INFO] Nothing to compile - all classes are up to date
[INFO]
[INFO] --- maven-resources-plugin:2.7:testResources (default-testResources) @ simple ---
[INFO] Using 'UTF-8' encoding to copy filtered resources.
[INFO] skip non existing resourceDirectory <https://builds.apache.org/job/OpenJPA-2.4.x/ws/openjpa-examples/simple/src/test/resources>
[INFO] Copying 3 resources
[INFO]
[INFO] --- maven-compiler-plugin:3.5.1:testCompile (default-testCompile) @ simple ---
[INFO] Nothing to compile - all classes are up to date
[INFO]
[INFO] --- maven-surefire-plugin:2.19.1:test (default-test) @ simple ---
[INFO]
[INFO] --- maven-jar-plugin:2.6:jar (default-jar) @ simple ---
[INFO] Building jar: <https://builds.apache.org/job/OpenJPA-2.4.x/ws/openjpa-examples/simple/target/simple-2.4.3-SNAPSHOT.jar>
[INFO]
[INFO] --- maven-site-plugin:3.4:attach-descriptor (attach-descriptor) @ simple ---
[INFO]
[INFO] --- maven-jar-plugin:2.6:test-jar (attach-tests) @ simple ---
[INFO] Building jar: <https://builds.apache.org/job/OpenJPA-2.4.x/ws/openjpa-examples/simple/target/simple-2.4.3-SNAPSHOT-tests.jar>
[INFO]
[INFO] --- ianal-maven-plugin:1.0-alpha-1:verify-legal-files (default) @ simple ---
[INFO] Checking legal files in: simple-2.4.3-SNAPSHOT.jar
[INFO] Checking legal files in: simple-2.4.3-SNAPSHOT-tests.jar
[INFO]
[INFO] --- apache-rat-plugin:0.11:check (default) @ simple ---
[INFO] 51 implicit excludes (use -debug for more details).
[INFO] Exclude: **/.*/**
[INFO] Exclude: **/target/**/*
[INFO] 23 resources included (use -debug for more details)
[INFO] Rat check: Summary of files. Unapproved: 0 unknown: 0 generated: 0 approved: 22 licence.
[INFO]
[INFO] --- maven-install-plugin:2.5.2:install (default-install) @ simple ---
[INFO] Installing <https://builds.apache.org/job/OpenJPA-2.4.x/ws/openjpa-examples/simple/target/simple-2.4.3-SNAPSHOT.jar> to /home/jenkins/.m2/repository/org/apache/openjpa/openjpa-examples/simple/2.4.3-SNAPSHOT/simple-2.4.3-SNAPSHOT.jar
[INFO] Installing <https://builds.apache.org/job/OpenJPA-2.4.x/ws/openjpa-examples/simple/pom.xml> to /home/jenkins/.m2/repository/org/apache/openjpa/openjpa-examples/simple/2.4.3-SNAPSHOT/simple-2.4.3-SNAPSHOT.pom
[INFO] Installing <https://builds.apache.org/job/OpenJPA-2.4.x/ws/openjpa-examples/simple/target/simple-2.4.3-SNAPSHOT-tests.jar> to /home/jenkins/.m2/repository/org/apache/openjpa/openjpa-examples/simple/2.4.3-SNAPSHOT/simple-2.4.3-SNAPSHOT-tests.jar
[INFO]                                                                        
[INFO] ------------------------------------------------------------------------
[INFO] Building OpenJPA Examples - image-gallery 2.4.3-SNAPSHOT
[INFO] ------------------------------------------------------------------------
[INFO]
[INFO] --- maven-clean-plugin:2.5:clean (default-clean) @ image-gallery ---
[INFO]
[INFO] --- buildnumber-maven-plugin:1.4:create (default) @ image-gallery ---
[INFO]
[INFO] --- maven-enforcer-plugin:1.3.1:enforce (default) @ image-gallery ---
[INFO]
[INFO] --- maven-checkstyle-plugin:2.9:checkstyle (default) @ image-gallery ---
[INFO] Starting audit...
Audit done.

[WARNING] Unable to locate Source XRef to link to - DISABLED
[INFO]
[INFO] --- maven-remote-resources-plugin:1.5:process (default) @ image-gallery ---
[INFO]
[INFO] --- maven-resources-plugin:2.7:resources (default-resources) @ image-gallery ---
[INFO] Using 'UTF-8' encoding to copy filtered resources.
[INFO] skip non existing resourceDirectory <https://builds.apache.org/job/OpenJPA-2.4.x/ws/openjpa-examples/image-gallery/src/main/resources>
[INFO] Copying 3 resources
[INFO]
[INFO] --- maven-compiler-plugin:3.5.1:compile (default-compile) @ image-gallery ---
[INFO] Nothing to compile - all classes are up to date
[INFO]
[INFO] --- maven-compiler-plugin:3.5.1:testCompile (test-source-compile) @ image-gallery ---
[INFO] Changes detected - recompiling the module!
[INFO] Compiling 12 source files to <https://builds.apache.org/job/OpenJPA-2.4.x/ws/openjpa-examples/image-gallery/target/test-classes>
[INFO] -------------------------------------------------------------
[ERROR] COMPILATION ERROR :
[INFO] -------------------------------------------------------------
[ERROR] error: Bad service configuration file, or exception thrown while constructing Processor object: javax.annotation.processing.Processor: Provider org.apache.openjpa.persistence.meta.AnnotationProcessor6 could not be instantiated: java.lang.OutOfMemoryError: PermGen space
[INFO] 1 error
[INFO] -------------------------------------------------------------
[INFO] ------------------------------------------------------------------------
[INFO] Reactor Summary:
[INFO]
[INFO] OpenJPA Parent POM ................................ SUCCESS [10.203s]
[INFO] OpenJPA Utilities Library ......................... SUCCESS [12.137s]
[INFO] OpenJPA Kernel .................................... SUCCESS [14.797s]
[INFO] OpenJPA JDBC ...................................... SUCCESS [6.849s]
[INFO] OpenJPA Persistence ............................... SUCCESS [6.412s]
[INFO] OpenJPA Persistence JDBC .......................... SUCCESS [12:06.724s]
[INFO] OpenJPA Persistence Locking Tests ................. SUCCESS [23:44.380s]
[INFO] OpenJPA tools ..................................... SUCCESS [0.307s]
[INFO] OpenJPA Maven Plugin .............................. SUCCESS [1:18.087s]
[INFO] OpenJPA XML Store ................................. SUCCESS [5.900s]
[INFO] OpenJPA Slice ..................................... SUCCESS [1.944s]
[INFO] OpenJPA JEST ...................................... SUCCESS [10.711s]
[INFO] OpenJPA Aggregate Jar ............................. SUCCESS [5.826s]
[INFO] OpenJPA Aggregate Jar with Dependencies ........... SUCCESS [1.392s]
[INFO] OpenJPA Project Docs and Assemblies ............... SUCCESS [7.530s]
[INFO] OpenJPA Examples .................................. SUCCESS [0.101s]
[INFO] OpenJPA Examples - Simple ......................... SUCCESS [2.576s]
[INFO] OpenJPA Examples - image-gallery .................. FAILURE [6.160s]
[INFO] OpenJPA Examples - OpenBooks ...................... SKIPPED
[INFO] OpenJPA Integration Tests ......................... SKIPPED
[INFO] OpenJPA Integration Tests - Daytrader ............. SKIPPED
[INFO] OpenJPA Integration Tests - Examples .............. SKIPPED
[INFO] OpenJPA Integration Tests - SLF4JLogFactory ....... SKIPPED
[INFO] OpenJPA Integration Tests - JPA TCK ............... SKIPPED
[INFO] OpenJPA Integration Tests - Bean Validation ....... SKIPPED
[INFO] OpenJPA Integration Tests - JMX Platform MBeans ... SKIPPED
[INFO] OpenJPA Fetching Statistic Tool ................... SKIPPED
[INFO] OpenJPA Fetching Statistic Tool -- WAS Bundle ..... SKIPPED
[INFO] ------------------------------------------------------------------------
[INFO] BUILD FAILURE
[INFO] ------------------------------------------------------------------------
[INFO] Total time: 38:43.907s
[INFO] Finished at: Wed Jul 19 15:40:28 UTC 2017
[INFO] Final Memory: 71M/3985M
[INFO] ------------------------------------------------------------------------
[ERROR] Failed to execute goal org.apache.maven.plugins:maven-compiler-plugin:3.5.1:testCompile (test-source-compile) on project image-gallery: Compilation failure
[ERROR] error: Bad service configuration file, or exception thrown while constructing Processor object: javax.annotation.processing.Processor: Provider org.apache.openjpa.persistence.meta.AnnotationProcessor6 could not be instantiated: java.lang.OutOfMemoryError: PermGen space
[ERROR] -> [Help 1]
[ERROR]
[ERROR] To see the full stack trace of the errors, re-run Maven with the -e switch.
[ERROR] Re-run Maven using the -X switch to enable full debug logging.
[ERROR]
[ERROR] For more information about the errors and possible solutions, please read the following articles:
[ERROR] [Help 1] http://cwiki.apache.org/confluence/display/MAVEN/MojoFailureException
[ERROR]
[ERROR] After correcting the problems, you can resume the build with the command
[ERROR]   mvn <goals> -rf :image-gallery
Build step 'Execute shell' marked build as failure
Archiving artifacts
Setting ANT_1_9_7_HOME=/home/jenkins/tools/ant/apache-ant-1.9.7
Setting JDK_1_6_LATEST__HOME=/home/jenkins/tools/java/latest1.6
Setting MAVEN_3_0_4_HOME=/home/jenkins/tools/maven/apache-maven-3.0.4
[Fast Archiver] No prior successful build to compare, so performing full copy of artifacts
Recording test results
Setting ANT_1_9_7_HOME=/home/jenkins/tools/ant/apache-ant-1.9.7
Setting JDK_1_6_LATEST__HOME=/home/jenkins/tools/java/latest1.6
Setting MAVEN_3_0_4_HOME=/home/jenkins/tools/maven/apache-maven-3.0.4
Setting ANT_1_9_7_HOME=/home/jenkins/tools/ant/apache-ant-1.9.7
Setting JDK_1_6_LATEST__HOME=/home/jenkins/tools/java/latest1.6
Setting MAVEN_3_0_4_HOME=/home/jenkins/tools/maven/apache-maven-3.0.4
Reply | Threaded
Open this post in threaded view
|  
Report Content as Inappropriate

Build failed in Jenkins: OpenJPA-2.4.x #2

Apache Jenkins Server-2
See <https://builds.apache.org/job/OpenJPA-2.4.x/2/display/redirect>

------------------------------------------
[...truncated 4.46 MB...]
[INFO]
[INFO] --- maven-compiler-plugin:3.5.1:testCompile (test-source-compile) @ apache-openjpa ---
[INFO] No sources to compile
[INFO]
[INFO] --- maven-assembly-plugin:2.6:attached (bin) @ apache-openjpa ---
[INFO] Reading assembly descriptor: assembly.xml
[INFO] Reading assembly descriptor: source-assembly.xml
[INFO] Reading assembly descriptor: bin-assembly.xml
[WARNING] The assembly descriptor contains a filesystem-root relative reference, which is not cross platform compatible /
[WARNING] Cannot include project artifact: org.apache.openjpa:apache-openjpa:pom:2.4.3-SNAPSHOT; it doesn't have an associated file or directory.
[WARNING] Cannot include project artifact: org.apache.openjpa:apache-openjpa:pom:2.4.3-SNAPSHOT; it doesn't have an associated file or directory.
[INFO] Building zip: <https://builds.apache.org/job/OpenJPA-2.4.x/ws/openjpa-project/target/site/downloads/apache-openjpa-2.4.3-SNAPSHOT-binary.zip>
[INFO] Building zip: <https://builds.apache.org/job/OpenJPA-2.4.x/ws/openjpa-project/target/site/downloads/apache-openjpa-2.4.3-SNAPSHOT-source.zip>
[WARNING] The assembly descriptor contains a filesystem-root relative reference, which is not cross platform compatible /
[WARNING] Cannot include project artifact: org.apache.openjpa:apache-openjpa:pom:2.4.3-SNAPSHOT; it doesn't have an associated file or directory.
[WARNING] Cannot include project artifact: org.apache.openjpa:apache-openjpa:pom:2.4.3-SNAPSHOT; it doesn't have an associated file or directory.
[INFO] Building zip: <https://builds.apache.org/job/OpenJPA-2.4.x/ws/openjpa-project/target/site/downloads/apache-openjpa-2.4.3-SNAPSHOT-binary-nodocs.zip>
[INFO]
[INFO] --- maven-site-plugin:3.4:attach-descriptor (attach-descriptor) @ apache-openjpa ---
[INFO]
[INFO] --- ianal-maven-plugin:1.0-alpha-1:verify-legal-files (default) @ apache-openjpa ---
[INFO] Checking legal files in: apache-openjpa-2.4.3-SNAPSHOT-binary.zip
[INFO] Checking legal files in: apache-openjpa-2.4.3-SNAPSHOT-source.zip
[WARNING] Artifact does not contain any legal files: apache-openjpa-2.4.3-SNAPSHOT-source.zip
[INFO] Checking legal files in: apache-openjpa-2.4.3-SNAPSHOT-binary-nodocs.zip
[INFO]
[INFO] --- apache-rat-plugin:0.11:check (default) @ apache-openjpa ---
[INFO] 51 implicit excludes (use -debug for more details).
[INFO] Exclude: **/.*/**
[INFO] Exclude: **/target/**/*
[INFO] 41 resources included (use -debug for more details)
[INFO] Rat check: Summary of files. Unapproved: 0 unknown: 0 generated: 0 approved: 41 licence.
[INFO]
[INFO] --- maven-install-plugin:2.5.2:install (default-install) @ apache-openjpa ---
[INFO] Installing <https://builds.apache.org/job/OpenJPA-2.4.x/ws/openjpa-project/pom.xml> to /home/jenkins/.m2/repository/org/apache/openjpa/apache-openjpa/2.4.3-SNAPSHOT/apache-openjpa-2.4.3-SNAPSHOT.pom
[INFO] Installing <https://builds.apache.org/job/OpenJPA-2.4.x/ws/openjpa-project/target/site/downloads/apache-openjpa-2.4.3-SNAPSHOT-binary.zip> to /home/jenkins/.m2/repository/org/apache/openjpa/apache-openjpa/2.4.3-SNAPSHOT/apache-openjpa-2.4.3-SNAPSHOT-binary.zip
[INFO] Installing <https://builds.apache.org/job/OpenJPA-2.4.x/ws/openjpa-project/target/site/downloads/apache-openjpa-2.4.3-SNAPSHOT-source.zip> to /home/jenkins/.m2/repository/org/apache/openjpa/apache-openjpa/2.4.3-SNAPSHOT/apache-openjpa-2.4.3-SNAPSHOT-source.zip
[INFO] Installing <https://builds.apache.org/job/OpenJPA-2.4.x/ws/openjpa-project/target/site/downloads/apache-openjpa-2.4.3-SNAPSHOT-binary-nodocs.zip> to /home/jenkins/.m2/repository/org/apache/openjpa/apache-openjpa/2.4.3-SNAPSHOT/apache-openjpa-2.4.3-SNAPSHOT-binary-nodocs.zip
[INFO]                                                                        
[INFO] ------------------------------------------------------------------------
[INFO] Building OpenJPA Examples 2.4.3-SNAPSHOT
[INFO] ------------------------------------------------------------------------
[INFO]
[INFO] --- maven-clean-plugin:2.5:clean (default-clean) @ openjpa-examples ---
[INFO] Deleting <https://builds.apache.org/job/OpenJPA-2.4.x/ws/openjpa-examples/target>
[INFO]
[INFO] --- buildnumber-maven-plugin:1.4:create (default) @ openjpa-examples ---
[INFO]
[INFO] --- maven-enforcer-plugin:1.3.1:enforce (default) @ openjpa-examples ---
[INFO]
[INFO] --- maven-checkstyle-plugin:2.9:checkstyle (default) @ openjpa-examples ---
[INFO]
[INFO] --- maven-remote-resources-plugin:1.5:process (default) @ openjpa-examples ---
[INFO]
[INFO] --- maven-compiler-plugin:3.5.1:testCompile (test-source-compile) @ openjpa-examples ---
[INFO] No sources to compile
[INFO]
[INFO] --- maven-site-plugin:3.4:attach-descriptor (attach-descriptor) @ openjpa-examples ---
[INFO]
[INFO] --- ianal-maven-plugin:1.0-alpha-1:verify-legal-files (default) @ openjpa-examples ---
[INFO]
[INFO] --- apache-rat-plugin:0.11:check (default) @ openjpa-examples ---
[INFO] 51 implicit excludes (use -debug for more details).
[INFO] Exclude: **/.*/**
[INFO] Exclude: **/target/**/*
[INFO] 168 resources included (use -debug for more details)
[INFO] Rat check: Summary of files. Unapproved: 0 unknown: 0 generated: 0 approved: 167 licence.
[INFO]
[INFO] --- maven-install-plugin:2.5.2:install (default-install) @ openjpa-examples ---
[INFO] Installing <https://builds.apache.org/job/OpenJPA-2.4.x/ws/openjpa-examples/pom.xml> to /home/jenkins/.m2/repository/org/apache/openjpa/openjpa-examples/2.4.3-SNAPSHOT/openjpa-examples-2.4.3-SNAPSHOT.pom
[INFO]                                                                        
[INFO] ------------------------------------------------------------------------
[INFO] Building OpenJPA Examples - Simple 2.4.3-SNAPSHOT
[INFO] ------------------------------------------------------------------------
[INFO]
[INFO] --- maven-clean-plugin:2.5:clean (default-clean) @ simple ---
[INFO] Deleting <https://builds.apache.org/job/OpenJPA-2.4.x/ws/openjpa-examples/simple/target>
[INFO]
[INFO] --- buildnumber-maven-plugin:1.4:create (default) @ simple ---
[INFO]
[INFO] --- maven-enforcer-plugin:1.3.1:enforce (default) @ simple ---
[INFO]
[INFO] --- maven-checkstyle-plugin:2.9:checkstyle (default) @ simple ---
[INFO] Starting audit...
Audit done.

[WARNING] Unable to locate Source XRef to link to - DISABLED
[INFO]
[INFO] --- maven-remote-resources-plugin:1.5:process (default) @ simple ---
[INFO]
[INFO] --- maven-resources-plugin:2.7:resources (default-resources) @ simple ---
[INFO] Using 'UTF-8' encoding to copy filtered resources.
[INFO] skip non existing resourceDirectory <https://builds.apache.org/job/OpenJPA-2.4.x/ws/openjpa-examples/simple/src/main/resources>
[INFO] Copying 3 resources
[INFO]
[INFO] --- maven-compiler-plugin:3.5.1:compile (default-compile) @ simple ---
[INFO] Changes detected - recompiling the module!
[INFO] Compiling 12 source files to <https://builds.apache.org/job/OpenJPA-2.4.x/ws/openjpa-examples/simple/target/classes>
[INFO] Some input files use unchecked or unsafe operations.
[INFO] Recompile with -Xlint:unchecked for details.
[INFO]
[INFO] --- maven-compiler-plugin:3.5.1:testCompile (test-source-compile) @ simple ---
[INFO] Nothing to compile - all classes are up to date
[INFO]
[INFO] --- maven-resources-plugin:2.7:testResources (default-testResources) @ simple ---
[INFO] Using 'UTF-8' encoding to copy filtered resources.
[INFO] skip non existing resourceDirectory <https://builds.apache.org/job/OpenJPA-2.4.x/ws/openjpa-examples/simple/src/test/resources>
[INFO] Copying 3 resources
[INFO]
[INFO] --- maven-compiler-plugin:3.5.1:testCompile (default-testCompile) @ simple ---
[INFO] Nothing to compile - all classes are up to date
[INFO]
[INFO] --- maven-surefire-plugin:2.19.1:test (default-test) @ simple ---
[INFO]
[INFO] --- maven-jar-plugin:2.6:jar (default-jar) @ simple ---
[INFO] Building jar: <https://builds.apache.org/job/OpenJPA-2.4.x/ws/openjpa-examples/simple/target/simple-2.4.3-SNAPSHOT.jar>
[INFO]
[INFO] --- maven-site-plugin:3.4:attach-descriptor (attach-descriptor) @ simple ---
[INFO]
[INFO] --- maven-jar-plugin:2.6:test-jar (attach-tests) @ simple ---
[INFO] Building jar: <https://builds.apache.org/job/OpenJPA-2.4.x/ws/openjpa-examples/simple/target/simple-2.4.3-SNAPSHOT-tests.jar>
[INFO]
[INFO] --- ianal-maven-plugin:1.0-alpha-1:verify-legal-files (default) @ simple ---
[INFO] Checking legal files in: simple-2.4.3-SNAPSHOT.jar
[INFO] Checking legal files in: simple-2.4.3-SNAPSHOT-tests.jar
[INFO]
[INFO] --- apache-rat-plugin:0.11:check (default) @ simple ---
[INFO] 51 implicit excludes (use -debug for more details).
[INFO] Exclude: **/.*/**
[INFO] Exclude: **/target/**/*
[INFO] 23 resources included (use -debug for more details)
[INFO] Rat check: Summary of files. Unapproved: 0 unknown: 0 generated: 0 approved: 22 licence.
[INFO]
[INFO] --- maven-install-plugin:2.5.2:install (default-install) @ simple ---
[INFO] Installing <https://builds.apache.org/job/OpenJPA-2.4.x/ws/openjpa-examples/simple/target/simple-2.4.3-SNAPSHOT.jar> to /home/jenkins/.m2/repository/org/apache/openjpa/openjpa-examples/simple/2.4.3-SNAPSHOT/simple-2.4.3-SNAPSHOT.jar
[INFO] Installing <https://builds.apache.org/job/OpenJPA-2.4.x/ws/openjpa-examples/simple/pom.xml> to /home/jenkins/.m2/repository/org/apache/openjpa/openjpa-examples/simple/2.4.3-SNAPSHOT/simple-2.4.3-SNAPSHOT.pom
[INFO] Installing <https://builds.apache.org/job/OpenJPA-2.4.x/ws/openjpa-examples/simple/target/simple-2.4.3-SNAPSHOT-tests.jar> to /home/jenkins/.m2/repository/org/apache/openjpa/openjpa-examples/simple/2.4.3-SNAPSHOT/simple-2.4.3-SNAPSHOT-tests.jar
[INFO]                                                                        
[INFO] ------------------------------------------------------------------------
[INFO] Building OpenJPA Examples - image-gallery 2.4.3-SNAPSHOT
[INFO] ------------------------------------------------------------------------
[INFO]
[INFO] --- maven-clean-plugin:2.5:clean (default-clean) @ image-gallery ---
[INFO] Deleting <https://builds.apache.org/job/OpenJPA-2.4.x/ws/openjpa-examples/image-gallery/target>
[INFO]
[INFO] --- buildnumber-maven-plugin:1.4:create (default) @ image-gallery ---
[INFO]
[INFO] --- maven-enforcer-plugin:1.3.1:enforce (default) @ image-gallery ---
[INFO]
[INFO] --- maven-checkstyle-plugin:2.9:checkstyle (default) @ image-gallery ---
[INFO] Starting audit...
Audit done.

[WARNING] Unable to locate Source XRef to link to - DISABLED
[INFO]
[INFO] --- maven-remote-resources-plugin:1.5:process (default) @ image-gallery ---
[INFO]
[INFO] --- maven-resources-plugin:2.7:resources (default-resources) @ image-gallery ---
[INFO] Using 'UTF-8' encoding to copy filtered resources.
[INFO] skip non existing resourceDirectory <https://builds.apache.org/job/OpenJPA-2.4.x/ws/openjpa-examples/image-gallery/src/main/resources>
[INFO] Copying 3 resources
[INFO]
[INFO] --- maven-compiler-plugin:3.5.1:compile (default-compile) @ image-gallery ---
[INFO] Nothing to compile - all classes are up to date
[INFO]
[INFO] --- maven-compiler-plugin:3.5.1:testCompile (test-source-compile) @ image-gallery ---
[INFO] Changes detected - recompiling the module!
[INFO] Compiling 12 source files to <https://builds.apache.org/job/OpenJPA-2.4.x/ws/openjpa-examples/image-gallery/target/test-classes>
[INFO]
[INFO] --- maven-resources-plugin:2.7:testResources (default-testResources) @ image-gallery ---
[INFO] Using 'UTF-8' encoding to copy filtered resources.
[INFO] Copying 1 resource
[INFO] Copying 3 resources
[INFO]
[INFO] --- maven-compiler-plugin:3.5.1:testCompile (default-testCompile) @ image-gallery ---
[INFO] Changes detected - recompiling the module!
[INFO] Compiling 12 source files to <https://builds.apache.org/job/OpenJPA-2.4.x/ws/openjpa-examples/image-gallery/target/test-classes>
[INFO]
[INFO] --- openjpa-maven-plugin:2.4.3-SNAPSHOT:test-enhance (enhancer) @ image-gallery ---
801  BeanValidation  INFO   [main] openjpa.Tool - Enhancer running on type "org.apache.openjpa.example.gallery.model.Location".
---------------------------------------------------
constituent[0]: file:/home/jenkins/tools/maven/apache-maven-3.0.4/lib/plexus-cipher-1.7.jar
constituent[1]: file:/home/jenkins/tools/maven/apache-maven-3.0.4/lib/commons-cli-1.2.jar
constituent[2]: file:/home/jenkins/tools/maven/apache-maven-3.0.4/lib/plexus-sec-dispatcher-1.3.jar
constituent[3]: file:/home/jenkins/tools/maven/apache-maven-3.0.4/lib/maven-artifact-3.0.4.jar
constituent[4]: file:/home/jenkins/tools/maven/apache-maven-3.0.4/lib/maven-model-builder-3.0.4.jar
constituent[5]: file:/home/jenkins/tools/maven/apache-maven-3.0.4/lib/wagon-http-2.2-shaded.jar
constituent[6]: file:/home/jenkins/tools/maven/apache-maven-3.0.4/lib/wagon-file-2.2.jar
constituent[7]: file:/home/jenkins/tools/maven/apache-maven-3.0.4/lib/maven-aether-provider-3.0.4.jar
constituent[8]: file:/home/jenkins/tools/maven/apache-maven-3.0.4/lib/maven-settings-builder-3.0.4.jar
constituent[9]: file:/home/jenkins/tools/maven/apache-maven-3.0.4/lib/sisu-inject-bean-2.3.0.jar
constituent[10]: file:/home/jenkins/tools/maven/apache-maven-3.0.4/lib/aether-impl-1.13.1.jar
constituent[11]: file:/home/jenkins/tools/maven/apache-maven-3.0.4/lib/maven-compat-3.0.4.jar
constituent[12]: file:/home/jenkins/tools/maven/apache-maven-3.0.4/lib/maven-embedder-3.0.4.jar
constituent[13]: file:/home/jenkins/tools/maven/apache-maven-3.0.4/lib/maven-settings-3.0.4.jar
constituent[14]: file:/home/jenkins/tools/maven/apache-maven-3.0.4/lib/sisu-guava-0.9.9.jar
constituent[15]: file:/home/jenkins/tools/maven/apache-maven-3.0.4/lib/sisu-inject-plexus-2.3.0.jar
constituent[16]: file:/home/jenkins/tools/maven/apache-maven-3.0.4/lib/plexus-interpolation-1.14.jar
constituent[17]: file:/home/jenkins/tools/maven/apache-maven-3.0.4/lib/maven-model-3.0.4.jar
constituent[18]: file:/home/jenkins/tools/maven/apache-maven-3.0.4/lib/aether-api-1.13.1.jar
constituent[19]: file:/home/jenkins/tools/maven/apache-maven-3.0.4/lib/maven-plugin-api-3.0.4.jar
constituent[20]: file:/home/jenkins/tools/maven/apache-maven-3.0.4/lib/wagon-provider-api-2.2.jar
constituent[21]: file:/home/jenkins/tools/maven/apache-maven-3.0.4/lib/plexus-utils-2.0.6.jar
constituent[22]: file:/home/jenkins/tools/maven/apache-maven-3.0.4/lib/sisu-guice-3.1.0-no_aop.jar
constituent[23]: file:/home/jenkins/tools/maven/apache-maven-3.0.4/lib/maven-repository-metadata-3.0.4.jar
constituent[24]: file:/home/jenkins/tools/maven/apache-maven-3.0.4/lib/maven-core-3.0.4.jar
constituent[25]: file:/home/jenkins/tools/maven/apache-maven-3.0.4/lib/plexus-component-annotations-1.5.5.jar
constituent[26]: file:/home/jenkins/tools/maven/apache-maven-3.0.4/lib/aether-connector-wagon-1.13.1.jar
constituent[27]: file:/home/jenkins/tools/maven/apache-maven-3.0.4/lib/aether-spi-1.13.1.jar
constituent[28]: file:/home/jenkins/tools/maven/apache-maven-3.0.4/lib/aether-util-1.13.1.jar
---------------------------------------------------
Exception in thread "main" java.lang.OutOfMemoryError: PermGen space
        at java.lang.ClassLoader.defineClass1(Native Method)
        at java.lang.ClassLoader.defineClassCond(ClassLoader.java:631)
        at java.lang.ClassLoader.defineClass(ClassLoader.java:615)
        at java.security.SecureClassLoader.defineClass(SecureClassLoader.java:141)
        at java.net.URLClassLoader.defineClass(URLClassLoader.java:283)
        at java.net.URLClassLoader.access$000(URLClassLoader.java:58)
        at java.net.URLClassLoader$1.run(URLClassLoader.java:197)
        at java.security.AccessController.doPrivileged(Native Method)
        at java.net.URLClassLoader.findClass(URLClassLoader.java:190)
        at org.codehaus.plexus.classworlds.realm.ClassRealm.loadClassFromSelf(ClassRealm.java:386)
        at org.codehaus.plexus.classworlds.strategy.SelfFirstStrategy.loadClass(SelfFirstStrategy.java:42)
        at org.codehaus.plexus.classworlds.realm.ClassRealm.loadClass(ClassRealm.java:244)
        at org.codehaus.plexus.classworlds.realm.ClassRealm.loadClass(ClassRealm.java:230)
        at org.apache.maven.cli.MavenCli.execute(MavenCli.java:545)
        at org.apache.maven.cli.MavenCli.doMain(MavenCli.java:196)
        at org.apache.maven.cli.MavenCli.main(MavenCli.java:141)
        at sun.reflect.NativeMethodAccessorImpl.invoke0(Native Method)
        at sun.reflect.NativeMethodAccessorImpl.invoke(NativeMethodAccessorImpl.java:39)
        at sun.reflect.DelegatingMethodAccessorImpl.invoke(DelegatingMethodAccessorImpl.java:25)
        at java.lang.reflect.Method.invoke(Method.java:597)
        at org.codehaus.plexus.classworlds.launcher.Launcher.launchEnhanced(Launcher.java:290)
        at org.codehaus.plexus.classworlds.launcher.Launcher.launch(Launcher.java:230)
        at org.codehaus.plexus.classworlds.launcher.Launcher.mainWithExitCode(Launcher.java:409)
        at org.codehaus.plexus.classworlds.launcher.Launcher.main(Launcher.java:352)
Build step 'Execute shell' marked build as failure
Archiving artifacts
Setting ANT_1_9_7_HOME=/home/jenkins/tools/ant/apache-ant-1.9.7
Setting JDK_1_6_LATEST__HOME=/home/jenkins/tools/java/latest1.6
Setting MAVEN_3_0_4_HOME=/home/jenkins/tools/maven/apache-maven-3.0.4
[Fast Archiver] No prior successful build to compare, so performing full copy of artifacts
Recording test results
Setting ANT_1_9_7_HOME=/home/jenkins/tools/ant/apache-ant-1.9.7
Setting JDK_1_6_LATEST__HOME=/home/jenkins/tools/java/latest1.6
Setting MAVEN_3_0_4_HOME=/home/jenkins/tools/maven/apache-maven-3.0.4
Setting ANT_1_9_7_HOME=/home/jenkins/tools/ant/apache-ant-1.9.7
Setting JDK_1_6_LATEST__HOME=/home/jenkins/tools/java/latest1.6
Setting MAVEN_3_0_4_HOME=/home/jenkins/tools/maven/apache-maven-3.0.4
Reply | Threaded
Open this post in threaded view
|  
Report Content as Inappropriate

Build failed in Jenkins: OpenJPA-2.4.x #3

Apache Jenkins Server-2
See <https://builds.apache.org/job/OpenJPA-2.4.x/3/display/redirect>

------------------------------------------
[...truncated 4.46 MB...]
[INFO] Exclude: **/.*/**
[INFO] Exclude: **/target/**/*
[INFO] 2 resources included (use -debug for more details)
[INFO] Rat check: Summary of files. Unapproved: 0 unknown: 0 generated: 0 approved: 2 licence.
[INFO]
[INFO] --- maven-install-plugin:2.5.2:install (default-install) @ openjpa-all ---
[INFO] Installing <https://builds.apache.org/job/OpenJPA-2.4.x/3/artifact/openjpa-all/target/openjpa-all-2.4.3-SNAPSHOT.jar> to /home/jenkins/.m2/repository/org/apache/openjpa/openjpa-all/2.4.3-SNAPSHOT/openjpa-all-2.4.3-SNAPSHOT.jar
[INFO] Installing <https://builds.apache.org/job/OpenJPA-2.4.x/ws/openjpa-all/dependency-reduced-pom.xml> to /home/jenkins/.m2/repository/org/apache/openjpa/openjpa-all/2.4.3-SNAPSHOT/openjpa-all-2.4.3-SNAPSHOT.pom
[INFO] Installing <https://builds.apache.org/job/OpenJPA-2.4.x/3/artifact/openjpa-all/target/openjpa-all-2.4.3-SNAPSHOT-tests.jar> to /home/jenkins/.m2/repository/org/apache/openjpa/openjpa-all/2.4.3-SNAPSHOT/openjpa-all-2.4.3-SNAPSHOT-tests.jar
[INFO]                                                                        
[INFO] ------------------------------------------------------------------------
[INFO] Building OpenJPA Project Docs and Assemblies 2.4.3-SNAPSHOT
[INFO] ------------------------------------------------------------------------
[INFO]
[INFO] --- maven-clean-plugin:2.5:clean (default-clean) @ apache-openjpa ---
[INFO] Deleting <https://builds.apache.org/job/OpenJPA-2.4.x/ws/openjpa-project/target>
[INFO]
[INFO] --- buildnumber-maven-plugin:1.4:create (default) @ apache-openjpa ---
[INFO]
[INFO] --- maven-enforcer-plugin:1.3.1:enforce (default) @ apache-openjpa ---
[INFO]
[INFO] --- maven-checkstyle-plugin:2.9:checkstyle (default) @ apache-openjpa ---
[INFO]
[INFO] --- maven-remote-resources-plugin:1.5:process (default) @ apache-openjpa ---
[INFO]
[INFO] --- maven-compiler-plugin:3.5.1:testCompile (test-source-compile) @ apache-openjpa ---
[INFO] No sources to compile
[INFO]
[INFO] --- maven-assembly-plugin:2.6:attached (bin) @ apache-openjpa ---
[INFO] Reading assembly descriptor: assembly.xml
[INFO] Reading assembly descriptor: source-assembly.xml
[INFO] Reading assembly descriptor: bin-assembly.xml
[WARNING] The assembly descriptor contains a filesystem-root relative reference, which is not cross platform compatible /
[WARNING] Cannot include project artifact: org.apache.openjpa:apache-openjpa:pom:2.4.3-SNAPSHOT; it doesn't have an associated file or directory.
[WARNING] Cannot include project artifact: org.apache.openjpa:apache-openjpa:pom:2.4.3-SNAPSHOT; it doesn't have an associated file or directory.
[INFO] Building zip: <https://builds.apache.org/job/OpenJPA-2.4.x/ws/openjpa-project/target/site/downloads/apache-openjpa-2.4.3-SNAPSHOT-binary.zip>
[INFO] Building zip: <https://builds.apache.org/job/OpenJPA-2.4.x/ws/openjpa-project/target/site/downloads/apache-openjpa-2.4.3-SNAPSHOT-source.zip>
[WARNING] The assembly descriptor contains a filesystem-root relative reference, which is not cross platform compatible /
[WARNING] Cannot include project artifact: org.apache.openjpa:apache-openjpa:pom:2.4.3-SNAPSHOT; it doesn't have an associated file or directory.
[WARNING] Cannot include project artifact: org.apache.openjpa:apache-openjpa:pom:2.4.3-SNAPSHOT; it doesn't have an associated file or directory.
[INFO] Building zip: <https://builds.apache.org/job/OpenJPA-2.4.x/ws/openjpa-project/target/site/downloads/apache-openjpa-2.4.3-SNAPSHOT-binary-nodocs.zip>
[INFO]
[INFO] --- maven-site-plugin:3.4:attach-descriptor (attach-descriptor) @ apache-openjpa ---
[INFO]
[INFO] --- ianal-maven-plugin:1.0-alpha-1:verify-legal-files (default) @ apache-openjpa ---
[INFO] Checking legal files in: apache-openjpa-2.4.3-SNAPSHOT-binary.zip
[INFO] Checking legal files in: apache-openjpa-2.4.3-SNAPSHOT-source.zip
[WARNING] Artifact does not contain any legal files: apache-openjpa-2.4.3-SNAPSHOT-source.zip
[INFO] Checking legal files in: apache-openjpa-2.4.3-SNAPSHOT-binary-nodocs.zip
[INFO]
[INFO] --- apache-rat-plugin:0.11:check (default) @ apache-openjpa ---
[INFO] 51 implicit excludes (use -debug for more details).
[INFO] Exclude: **/.*/**
[INFO] Exclude: **/target/**/*
[INFO] 41 resources included (use -debug for more details)
[INFO] Rat check: Summary of files. Unapproved: 0 unknown: 0 generated: 0 approved: 41 licence.
[INFO]
[INFO] --- maven-install-plugin:2.5.2:install (default-install) @ apache-openjpa ---
[INFO] Installing <https://builds.apache.org/job/OpenJPA-2.4.x/ws/openjpa-project/pom.xml> to /home/jenkins/.m2/repository/org/apache/openjpa/apache-openjpa/2.4.3-SNAPSHOT/apache-openjpa-2.4.3-SNAPSHOT.pom
[INFO] Installing <https://builds.apache.org/job/OpenJPA-2.4.x/ws/openjpa-project/target/site/downloads/apache-openjpa-2.4.3-SNAPSHOT-binary.zip> to /home/jenkins/.m2/repository/org/apache/openjpa/apache-openjpa/2.4.3-SNAPSHOT/apache-openjpa-2.4.3-SNAPSHOT-binary.zip
[INFO] Installing <https://builds.apache.org/job/OpenJPA-2.4.x/ws/openjpa-project/target/site/downloads/apache-openjpa-2.4.3-SNAPSHOT-source.zip> to /home/jenkins/.m2/repository/org/apache/openjpa/apache-openjpa/2.4.3-SNAPSHOT/apache-openjpa-2.4.3-SNAPSHOT-source.zip
[INFO] Installing <https://builds.apache.org/job/OpenJPA-2.4.x/ws/openjpa-project/target/site/downloads/apache-openjpa-2.4.3-SNAPSHOT-binary-nodocs.zip> to /home/jenkins/.m2/repository/org/apache/openjpa/apache-openjpa/2.4.3-SNAPSHOT/apache-openjpa-2.4.3-SNAPSHOT-binary-nodocs.zip
[INFO]                                                                        
[INFO] ------------------------------------------------------------------------
[INFO] Building OpenJPA Examples 2.4.3-SNAPSHOT
[INFO] ------------------------------------------------------------------------
[INFO]
[INFO] --- maven-clean-plugin:2.5:clean (default-clean) @ openjpa-examples ---
[INFO] Deleting <https://builds.apache.org/job/OpenJPA-2.4.x/ws/openjpa-examples/target>
[INFO]
[INFO] --- buildnumber-maven-plugin:1.4:create (default) @ openjpa-examples ---
[INFO]
[INFO] --- maven-enforcer-plugin:1.3.1:enforce (default) @ openjpa-examples ---
[INFO]
[INFO] --- maven-checkstyle-plugin:2.9:checkstyle (default) @ openjpa-examples ---
[INFO]
[INFO] --- maven-remote-resources-plugin:1.5:process (default) @ openjpa-examples ---
[INFO]
[INFO] --- maven-compiler-plugin:3.5.1:testCompile (test-source-compile) @ openjpa-examples ---
[INFO] No sources to compile
[INFO]
[INFO] --- maven-site-plugin:3.4:attach-descriptor (attach-descriptor) @ openjpa-examples ---
[INFO]
[INFO] --- ianal-maven-plugin:1.0-alpha-1:verify-legal-files (default) @ openjpa-examples ---
[INFO]
[INFO] --- apache-rat-plugin:0.11:check (default) @ openjpa-examples ---
[INFO] 51 implicit excludes (use -debug for more details).
[INFO] Exclude: **/.*/**
[INFO] Exclude: **/target/**/*
[INFO] 168 resources included (use -debug for more details)
[INFO] Rat check: Summary of files. Unapproved: 0 unknown: 0 generated: 0 approved: 167 licence.
[INFO]
[INFO] --- maven-install-plugin:2.5.2:install (default-install) @ openjpa-examples ---
[INFO] Installing <https://builds.apache.org/job/OpenJPA-2.4.x/ws/openjpa-examples/pom.xml> to /home/jenkins/.m2/repository/org/apache/openjpa/openjpa-examples/2.4.3-SNAPSHOT/openjpa-examples-2.4.3-SNAPSHOT.pom
[INFO]                                                                        
[INFO] ------------------------------------------------------------------------
[INFO] Building OpenJPA Examples - Simple 2.4.3-SNAPSHOT
[INFO] ------------------------------------------------------------------------
[INFO]
[INFO] --- maven-clean-plugin:2.5:clean (default-clean) @ simple ---
[INFO] Deleting <https://builds.apache.org/job/OpenJPA-2.4.x/ws/openjpa-examples/simple/target>
[INFO]
[INFO] --- buildnumber-maven-plugin:1.4:create (default) @ simple ---
[INFO]
[INFO] --- maven-enforcer-plugin:1.3.1:enforce (default) @ simple ---
[INFO]
[INFO] --- maven-checkstyle-plugin:2.9:checkstyle (default) @ simple ---
[INFO] Starting audit...
Audit done.

[WARNING] Unable to locate Source XRef to link to - DISABLED
[INFO]
[INFO] --- maven-remote-resources-plugin:1.5:process (default) @ simple ---
[INFO]
[INFO] --- maven-resources-plugin:2.7:resources (default-resources) @ simple ---
[INFO] Using 'UTF-8' encoding to copy filtered resources.
[INFO] skip non existing resourceDirectory <https://builds.apache.org/job/OpenJPA-2.4.x/ws/openjpa-examples/simple/src/main/resources>
[INFO] Copying 3 resources
[INFO]
[INFO] --- maven-compiler-plugin:3.5.1:compile (default-compile) @ simple ---
[INFO] Changes detected - recompiling the module!
[INFO] Compiling 12 source files to <https://builds.apache.org/job/OpenJPA-2.4.x/ws/openjpa-examples/simple/target/classes>
[INFO] Some input files use unchecked or unsafe operations.
[INFO] Recompile with -Xlint:unchecked for details.
[INFO]
[INFO] --- maven-compiler-plugin:3.5.1:testCompile (test-source-compile) @ simple ---
[INFO] Nothing to compile - all classes are up to date
[INFO]
[INFO] --- maven-resources-plugin:2.7:testResources (default-testResources) @ simple ---
[INFO] Using 'UTF-8' encoding to copy filtered resources.
[INFO] skip non existing resourceDirectory <https://builds.apache.org/job/OpenJPA-2.4.x/ws/openjpa-examples/simple/src/test/resources>
[INFO] Copying 3 resources
[INFO]
[INFO] --- maven-compiler-plugin:3.5.1:testCompile (default-testCompile) @ simple ---
[INFO] Nothing to compile - all classes are up to date
[INFO]
[INFO] --- maven-surefire-plugin:2.19.1:test (default-test) @ simple ---
[INFO]
[INFO] --- maven-jar-plugin:2.6:jar (default-jar) @ simple ---
[INFO] Building jar: <https://builds.apache.org/job/OpenJPA-2.4.x/ws/openjpa-examples/simple/target/simple-2.4.3-SNAPSHOT.jar>
[INFO]
[INFO] --- maven-site-plugin:3.4:attach-descriptor (attach-descriptor) @ simple ---
[INFO]
[INFO] --- maven-jar-plugin:2.6:test-jar (attach-tests) @ simple ---
[INFO] Building jar: <https://builds.apache.org/job/OpenJPA-2.4.x/ws/openjpa-examples/simple/target/simple-2.4.3-SNAPSHOT-tests.jar>
[INFO]
[INFO] --- ianal-maven-plugin:1.0-alpha-1:verify-legal-files (default) @ simple ---
[INFO] Checking legal files in: simple-2.4.3-SNAPSHOT.jar
[INFO] Checking legal files in: simple-2.4.3-SNAPSHOT-tests.jar
[INFO]
[INFO] --- apache-rat-plugin:0.11:check (default) @ simple ---
[INFO] 51 implicit excludes (use -debug for more details).
[INFO] Exclude: **/.*/**
[INFO] Exclude: **/target/**/*
[INFO] 23 resources included (use -debug for more details)
[INFO] Rat check: Summary of files. Unapproved: 0 unknown: 0 generated: 0 approved: 22 licence.
[INFO]
[INFO] --- maven-install-plugin:2.5.2:install (default-install) @ simple ---
[INFO] Installing <https://builds.apache.org/job/OpenJPA-2.4.x/ws/openjpa-examples/simple/target/simple-2.4.3-SNAPSHOT.jar> to /home/jenkins/.m2/repository/org/apache/openjpa/openjpa-examples/simple/2.4.3-SNAPSHOT/simple-2.4.3-SNAPSHOT.jar
[INFO] Installing <https://builds.apache.org/job/OpenJPA-2.4.x/ws/openjpa-examples/simple/pom.xml> to /home/jenkins/.m2/repository/org/apache/openjpa/openjpa-examples/simple/2.4.3-SNAPSHOT/simple-2.4.3-SNAPSHOT.pom
[INFO] Installing <https://builds.apache.org/job/OpenJPA-2.4.x/ws/openjpa-examples/simple/target/simple-2.4.3-SNAPSHOT-tests.jar> to /home/jenkins/.m2/repository/org/apache/openjpa/openjpa-examples/simple/2.4.3-SNAPSHOT/simple-2.4.3-SNAPSHOT-tests.jar
[INFO]                                                                        
[INFO] ------------------------------------------------------------------------
[INFO] Building OpenJPA Examples - image-gallery 2.4.3-SNAPSHOT
[INFO] ------------------------------------------------------------------------
[INFO]
[INFO] --- maven-clean-plugin:2.5:clean (default-clean) @ image-gallery ---
[INFO] Deleting <https://builds.apache.org/job/OpenJPA-2.4.x/ws/openjpa-examples/image-gallery/target>
[INFO]
[INFO] --- buildnumber-maven-plugin:1.4:create (default) @ image-gallery ---
[INFO]
[INFO] --- maven-enforcer-plugin:1.3.1:enforce (default) @ image-gallery ---
[INFO]
[INFO] --- maven-checkstyle-plugin:2.9:checkstyle (default) @ image-gallery ---
[INFO] Starting audit...
Audit done.

[WARNING] Unable to locate Source XRef to link to - DISABLED
[INFO]
[INFO] --- maven-remote-resources-plugin:1.5:process (default) @ image-gallery ---
[INFO]
[INFO] --- maven-resources-plugin:2.7:resources (default-resources) @ image-gallery ---
[INFO] Using 'UTF-8' encoding to copy filtered resources.
[INFO] skip non existing resourceDirectory <https://builds.apache.org/job/OpenJPA-2.4.x/ws/openjpa-examples/image-gallery/src/main/resources>
[INFO] Copying 3 resources
[INFO]
[INFO] --- maven-compiler-plugin:3.5.1:compile (default-compile) @ image-gallery ---
[INFO] Nothing to compile - all classes are up to date
[INFO]
[INFO] --- maven-compiler-plugin:3.5.1:testCompile (test-source-compile) @ image-gallery ---
[INFO] Changes detected - recompiling the module!
[INFO] Compiling 12 source files to <https://builds.apache.org/job/OpenJPA-2.4.x/ws/openjpa-examples/image-gallery/target/test-classes>
[INFO]
[INFO] --- maven-resources-plugin:2.7:testResources (default-testResources) @ image-gallery ---
[INFO] Using 'UTF-8' encoding to copy filtered resources.
[INFO] Copying 1 resource
[INFO] Copying 3 resources
[INFO]
[INFO] --- maven-compiler-plugin:3.5.1:testCompile (default-testCompile) @ image-gallery ---
[INFO] Changes detected - recompiling the module!
[INFO] Compiling 12 source files to <https://builds.apache.org/job/OpenJPA-2.4.x/ws/openjpa-examples/image-gallery/target/test-classes>
[INFO]
[INFO] --- openjpa-maven-plugin:2.4.3-SNAPSHOT:test-enhance (enhancer) @ image-gallery ---
780  BeanValidation  INFO   [main] openjpa.Tool - Enhancer running on type "org.apache.openjpa.example.gallery.model.Location".
---------------------------------------------------
constituent[0]: file:/home/jenkins/tools/maven/apache-maven-3.0.4/lib/plexus-cipher-1.7.jar
constituent[1]: file:/home/jenkins/tools/maven/apache-maven-3.0.4/lib/commons-cli-1.2.jar
constituent[2]: file:/home/jenkins/tools/maven/apache-maven-3.0.4/lib/plexus-sec-dispatcher-1.3.jar
constituent[3]: file:/home/jenkins/tools/maven/apache-maven-3.0.4/lib/maven-artifact-3.0.4.jar
constituent[4]: file:/home/jenkins/tools/maven/apache-maven-3.0.4/lib/maven-model-builder-3.0.4.jar
constituent[5]: file:/home/jenkins/tools/maven/apache-maven-3.0.4/lib/wagon-http-2.2-shaded.jar
constituent[6]: file:/home/jenkins/tools/maven/apache-maven-3.0.4/lib/wagon-file-2.2.jar
constituent[7]: file:/home/jenkins/tools/maven/apache-maven-3.0.4/lib/maven-aether-provider-3.0.4.jar
constituent[8]: file:/home/jenkins/tools/maven/apache-maven-3.0.4/lib/maven-settings-builder-3.0.4.jar
constituent[9]: file:/home/jenkins/tools/maven/apache-maven-3.0.4/lib/sisu-inject-bean-2.3.0.jar
constituent[10]: file:/home/jenkins/tools/maven/apache-maven-3.0.4/lib/aether-impl-1.13.1.jar
constituent[11]: file:/home/jenkins/tools/maven/apache-maven-3.0.4/lib/maven-compat-3.0.4.jar
constituent[12]: file:/home/jenkins/tools/maven/apache-maven-3.0.4/lib/maven-embedder-3.0.4.jar
constituent[13]: file:/home/jenkins/tools/maven/apache-maven-3.0.4/lib/maven-settings-3.0.4.jar
constituent[14]: file:/home/jenkins/tools/maven/apache-maven-3.0.4/lib/sisu-guava-0.9.9.jar
constituent[15]: file:/home/jenkins/tools/maven/apache-maven-3.0.4/lib/sisu-inject-plexus-2.3.0.jar
constituent[16]: file:/home/jenkins/tools/maven/apache-maven-3.0.4/lib/plexus-interpolation-1.14.jar
constituent[17]: file:/home/jenkins/tools/maven/apache-maven-3.0.4/lib/maven-model-3.0.4.jar
constituent[18]: file:/home/jenkins/tools/maven/apache-maven-3.0.4/lib/aether-api-1.13.1.jar
constituent[19]: file:/home/jenkins/tools/maven/apache-maven-3.0.4/lib/maven-plugin-api-3.0.4.jar
constituent[20]: file:/home/jenkins/tools/maven/apache-maven-3.0.4/lib/wagon-provider-api-2.2.jar
constituent[21]: file:/home/jenkins/tools/maven/apache-maven-3.0.4/lib/plexus-utils-2.0.6.jar
constituent[22]: file:/home/jenkins/tools/maven/apache-maven-3.0.4/lib/sisu-guice-3.1.0-no_aop.jar
constituent[23]: file:/home/jenkins/tools/maven/apache-maven-3.0.4/lib/maven-repository-metadata-3.0.4.jar
constituent[24]: file:/home/jenkins/tools/maven/apache-maven-3.0.4/lib/maven-core-3.0.4.jar
constituent[25]: file:/home/jenkins/tools/maven/apache-maven-3.0.4/lib/plexus-component-annotations-1.5.5.jar
constituent[26]: file:/home/jenkins/tools/maven/apache-maven-3.0.4/lib/aether-connector-wagon-1.13.1.jar
constituent[27]: file:/home/jenkins/tools/maven/apache-maven-3.0.4/lib/aether-spi-1.13.1.jar
constituent[28]: file:/home/jenkins/tools/maven/apache-maven-3.0.4/lib/aether-util-1.13.1.jar
---------------------------------------------------
Exception in thread "main" java.lang.OutOfMemoryError: PermGen space
Build step 'Execute shell' marked build as failure
Archiving artifacts
Setting ANT_1_9_7_HOME=/home/jenkins/tools/ant/apache-ant-1.9.7
Setting JDK_1_6_LATEST__HOME=/home/jenkins/tools/java/latest1.6
Setting MAVEN_3_0_4_HOME=/home/jenkins/tools/maven/apache-maven-3.0.4
[Fast Archiver] No prior successful build to compare, so performing full copy of artifacts
Recording test results
Setting ANT_1_9_7_HOME=/home/jenkins/tools/ant/apache-ant-1.9.7
Setting JDK_1_6_LATEST__HOME=/home/jenkins/tools/java/latest1.6
Setting MAVEN_3_0_4_HOME=/home/jenkins/tools/maven/apache-maven-3.0.4
Setting ANT_1_9_7_HOME=/home/jenkins/tools/ant/apache-ant-1.9.7
Setting JDK_1_6_LATEST__HOME=/home/jenkins/tools/java/latest1.6
Setting MAVEN_3_0_4_HOME=/home/jenkins/tools/maven/apache-maven-3.0.4
Reply | Threaded
Open this post in threaded view
|  
Report Content as Inappropriate

Build failed in Jenkins: OpenJPA-2.4.x #4

Apache Jenkins Server-2
See <https://builds.apache.org/job/OpenJPA-2.4.x/4/display/redirect>

------------------------------------------
[...truncated 4.46 MB...]
[INFO] Exclude: **/.*/**
[INFO] Exclude: **/target/**/*
[INFO] 2 resources included (use -debug for more details)
[INFO] Rat check: Summary of files. Unapproved: 0 unknown: 0 generated: 0 approved: 2 licence.
[INFO]
[INFO] --- maven-install-plugin:2.5.2:install (default-install) @ openjpa-all ---
[INFO] Installing <https://builds.apache.org/job/OpenJPA-2.4.x/4/artifact/openjpa-all/target/openjpa-all-2.4.3-SNAPSHOT.jar> to /home/jenkins/.m2/repository/org/apache/openjpa/openjpa-all/2.4.3-SNAPSHOT/openjpa-all-2.4.3-SNAPSHOT.jar
[INFO] Installing <https://builds.apache.org/job/OpenJPA-2.4.x/ws/openjpa-all/dependency-reduced-pom.xml> to /home/jenkins/.m2/repository/org/apache/openjpa/openjpa-all/2.4.3-SNAPSHOT/openjpa-all-2.4.3-SNAPSHOT.pom
[INFO] Installing <https://builds.apache.org/job/OpenJPA-2.4.x/4/artifact/openjpa-all/target/openjpa-all-2.4.3-SNAPSHOT-tests.jar> to /home/jenkins/.m2/repository/org/apache/openjpa/openjpa-all/2.4.3-SNAPSHOT/openjpa-all-2.4.3-SNAPSHOT-tests.jar
[INFO]                                                                        
[INFO] ------------------------------------------------------------------------
[INFO] Building OpenJPA Project Docs and Assemblies 2.4.3-SNAPSHOT
[INFO] ------------------------------------------------------------------------
[INFO]
[INFO] --- maven-clean-plugin:2.5:clean (default-clean) @ apache-openjpa ---
[INFO] Deleting <https://builds.apache.org/job/OpenJPA-2.4.x/ws/openjpa-project/target>
[INFO]
[INFO] --- buildnumber-maven-plugin:1.4:create (default) @ apache-openjpa ---
[INFO]
[INFO] --- maven-enforcer-plugin:1.3.1:enforce (default) @ apache-openjpa ---
[INFO]
[INFO] --- maven-checkstyle-plugin:2.9:checkstyle (default) @ apache-openjpa ---
[INFO]
[INFO] --- maven-remote-resources-plugin:1.5:process (default) @ apache-openjpa ---
[INFO]
[INFO] --- maven-compiler-plugin:3.5.1:testCompile (test-source-compile) @ apache-openjpa ---
[INFO] No sources to compile
[INFO]
[INFO] --- maven-assembly-plugin:2.6:attached (bin) @ apache-openjpa ---
[INFO] Reading assembly descriptor: assembly.xml
[INFO] Reading assembly descriptor: source-assembly.xml
[INFO] Reading assembly descriptor: bin-assembly.xml
[WARNING] The assembly descriptor contains a filesystem-root relative reference, which is not cross platform compatible /
[WARNING] Cannot include project artifact: org.apache.openjpa:apache-openjpa:pom:2.4.3-SNAPSHOT; it doesn't have an associated file or directory.
[WARNING] Cannot include project artifact: org.apache.openjpa:apache-openjpa:pom:2.4.3-SNAPSHOT; it doesn't have an associated file or directory.
[INFO] Building zip: <https://builds.apache.org/job/OpenJPA-2.4.x/ws/openjpa-project/target/site/downloads/apache-openjpa-2.4.3-SNAPSHOT-binary.zip>
[INFO] Building zip: <https://builds.apache.org/job/OpenJPA-2.4.x/ws/openjpa-project/target/site/downloads/apache-openjpa-2.4.3-SNAPSHOT-source.zip>
[WARNING] The assembly descriptor contains a filesystem-root relative reference, which is not cross platform compatible /
[WARNING] Cannot include project artifact: org.apache.openjpa:apache-openjpa:pom:2.4.3-SNAPSHOT; it doesn't have an associated file or directory.
[WARNING] Cannot include project artifact: org.apache.openjpa:apache-openjpa:pom:2.4.3-SNAPSHOT; it doesn't have an associated file or directory.
[INFO] Building zip: <https://builds.apache.org/job/OpenJPA-2.4.x/ws/openjpa-project/target/site/downloads/apache-openjpa-2.4.3-SNAPSHOT-binary-nodocs.zip>
[INFO]
[INFO] --- maven-site-plugin:3.4:attach-descriptor (attach-descriptor) @ apache-openjpa ---
[INFO]
[INFO] --- ianal-maven-plugin:1.0-alpha-1:verify-legal-files (default) @ apache-openjpa ---
[INFO] Checking legal files in: apache-openjpa-2.4.3-SNAPSHOT-binary.zip
[INFO] Checking legal files in: apache-openjpa-2.4.3-SNAPSHOT-source.zip
[WARNING] Artifact does not contain any legal files: apache-openjpa-2.4.3-SNAPSHOT-source.zip
[INFO] Checking legal files in: apache-openjpa-2.4.3-SNAPSHOT-binary-nodocs.zip
[INFO]
[INFO] --- apache-rat-plugin:0.11:check (default) @ apache-openjpa ---
[INFO] 51 implicit excludes (use -debug for more details).
[INFO] Exclude: **/.*/**
[INFO] Exclude: **/target/**/*
[INFO] 41 resources included (use -debug for more details)
[INFO] Rat check: Summary of files. Unapproved: 0 unknown: 0 generated: 0 approved: 41 licence.
[INFO]
[INFO] --- maven-install-plugin:2.5.2:install (default-install) @ apache-openjpa ---
[INFO] Installing <https://builds.apache.org/job/OpenJPA-2.4.x/ws/openjpa-project/pom.xml> to /home/jenkins/.m2/repository/org/apache/openjpa/apache-openjpa/2.4.3-SNAPSHOT/apache-openjpa-2.4.3-SNAPSHOT.pom
[INFO] Installing <https://builds.apache.org/job/OpenJPA-2.4.x/ws/openjpa-project/target/site/downloads/apache-openjpa-2.4.3-SNAPSHOT-binary.zip> to /home/jenkins/.m2/repository/org/apache/openjpa/apache-openjpa/2.4.3-SNAPSHOT/apache-openjpa-2.4.3-SNAPSHOT-binary.zip
[INFO] Installing <https://builds.apache.org/job/OpenJPA-2.4.x/ws/openjpa-project/target/site/downloads/apache-openjpa-2.4.3-SNAPSHOT-source.zip> to /home/jenkins/.m2/repository/org/apache/openjpa/apache-openjpa/2.4.3-SNAPSHOT/apache-openjpa-2.4.3-SNAPSHOT-source.zip
[INFO] Installing <https://builds.apache.org/job/OpenJPA-2.4.x/ws/openjpa-project/target/site/downloads/apache-openjpa-2.4.3-SNAPSHOT-binary-nodocs.zip> to /home/jenkins/.m2/repository/org/apache/openjpa/apache-openjpa/2.4.3-SNAPSHOT/apache-openjpa-2.4.3-SNAPSHOT-binary-nodocs.zip
[INFO]                                                                        
[INFO] ------------------------------------------------------------------------
[INFO] Building OpenJPA Examples 2.4.3-SNAPSHOT
[INFO] ------------------------------------------------------------------------
[INFO]
[INFO] --- maven-clean-plugin:2.5:clean (default-clean) @ openjpa-examples ---
[INFO] Deleting <https://builds.apache.org/job/OpenJPA-2.4.x/ws/openjpa-examples/target>
[INFO]
[INFO] --- buildnumber-maven-plugin:1.4:create (default) @ openjpa-examples ---
[INFO]
[INFO] --- maven-enforcer-plugin:1.3.1:enforce (default) @ openjpa-examples ---
[INFO]
[INFO] --- maven-checkstyle-plugin:2.9:checkstyle (default) @ openjpa-examples ---
[INFO]
[INFO] --- maven-remote-resources-plugin:1.5:process (default) @ openjpa-examples ---
[INFO]
[INFO] --- maven-compiler-plugin:3.5.1:testCompile (test-source-compile) @ openjpa-examples ---
[INFO] No sources to compile
[INFO]
[INFO] --- maven-site-plugin:3.4:attach-descriptor (attach-descriptor) @ openjpa-examples ---
[INFO]
[INFO] --- ianal-maven-plugin:1.0-alpha-1:verify-legal-files (default) @ openjpa-examples ---
[INFO]
[INFO] --- apache-rat-plugin:0.11:check (default) @ openjpa-examples ---
[INFO] 51 implicit excludes (use -debug for more details).
[INFO] Exclude: **/.*/**
[INFO] Exclude: **/target/**/*
[INFO] 168 resources included (use -debug for more details)
[INFO] Rat check: Summary of files. Unapproved: 0 unknown: 0 generated: 0 approved: 167 licence.
[INFO]
[INFO] --- maven-install-plugin:2.5.2:install (default-install) @ openjpa-examples ---
[INFO] Installing <https://builds.apache.org/job/OpenJPA-2.4.x/ws/openjpa-examples/pom.xml> to /home/jenkins/.m2/repository/org/apache/openjpa/openjpa-examples/2.4.3-SNAPSHOT/openjpa-examples-2.4.3-SNAPSHOT.pom
[INFO]                                                                        
[INFO] ------------------------------------------------------------------------
[INFO] Building OpenJPA Examples - Simple 2.4.3-SNAPSHOT
[INFO] ------------------------------------------------------------------------
[INFO]
[INFO] --- maven-clean-plugin:2.5:clean (default-clean) @ simple ---
[INFO] Deleting <https://builds.apache.org/job/OpenJPA-2.4.x/ws/openjpa-examples/simple/target>
[INFO]
[INFO] --- buildnumber-maven-plugin:1.4:create (default) @ simple ---
[INFO]
[INFO] --- maven-enforcer-plugin:1.3.1:enforce (default) @ simple ---
[INFO]
[INFO] --- maven-checkstyle-plugin:2.9:checkstyle (default) @ simple ---
[INFO] Starting audit...
Audit done.

[WARNING] Unable to locate Source XRef to link to - DISABLED
[INFO]
[INFO] --- maven-remote-resources-plugin:1.5:process (default) @ simple ---
[INFO]
[INFO] --- maven-resources-plugin:2.7:resources (default-resources) @ simple ---
[INFO] Using 'UTF-8' encoding to copy filtered resources.
[INFO] skip non existing resourceDirectory <https://builds.apache.org/job/OpenJPA-2.4.x/ws/openjpa-examples/simple/src/main/resources>
[INFO] Copying 3 resources
[INFO]
[INFO] --- maven-compiler-plugin:3.5.1:compile (default-compile) @ simple ---
[INFO] Changes detected - recompiling the module!
[INFO] Compiling 12 source files to <https://builds.apache.org/job/OpenJPA-2.4.x/ws/openjpa-examples/simple/target/classes>
[INFO] Some input files use unchecked or unsafe operations.
[INFO] Recompile with -Xlint:unchecked for details.
[INFO]
[INFO] --- maven-compiler-plugin:3.5.1:testCompile (test-source-compile) @ simple ---
[INFO] Nothing to compile - all classes are up to date
[INFO]
[INFO] --- maven-resources-plugin:2.7:testResources (default-testResources) @ simple ---
[INFO] Using 'UTF-8' encoding to copy filtered resources.
[INFO] skip non existing resourceDirectory <https://builds.apache.org/job/OpenJPA-2.4.x/ws/openjpa-examples/simple/src/test/resources>
[INFO] Copying 3 resources
[INFO]
[INFO] --- maven-compiler-plugin:3.5.1:testCompile (default-testCompile) @ simple ---
[INFO] Nothing to compile - all classes are up to date
[INFO]
[INFO] --- maven-surefire-plugin:2.19.1:test (default-test) @ simple ---
[INFO]
[INFO] --- maven-jar-plugin:2.6:jar (default-jar) @ simple ---
[INFO] Building jar: <https://builds.apache.org/job/OpenJPA-2.4.x/ws/openjpa-examples/simple/target/simple-2.4.3-SNAPSHOT.jar>
[INFO]
[INFO] --- maven-site-plugin:3.4:attach-descriptor (attach-descriptor) @ simple ---
[INFO]
[INFO] --- maven-jar-plugin:2.6:test-jar (attach-tests) @ simple ---
[INFO] Building jar: <https://builds.apache.org/job/OpenJPA-2.4.x/ws/openjpa-examples/simple/target/simple-2.4.3-SNAPSHOT-tests.jar>
[INFO]
[INFO] --- ianal-maven-plugin:1.0-alpha-1:verify-legal-files (default) @ simple ---
[INFO] Checking legal files in: simple-2.4.3-SNAPSHOT.jar
[INFO] Checking legal files in: simple-2.4.3-SNAPSHOT-tests.jar
[INFO]
[INFO] --- apache-rat-plugin:0.11:check (default) @ simple ---
[INFO] 51 implicit excludes (use -debug for more details).
[INFO] Exclude: **/.*/**
[INFO] Exclude: **/target/**/*
[INFO] 23 resources included (use -debug for more details)
[INFO] Rat check: Summary of files. Unapproved: 0 unknown: 0 generated: 0 approved: 22 licence.
[INFO]
[INFO] --- maven-install-plugin:2.5.2:install (default-install) @ simple ---
[INFO] Installing <https://builds.apache.org/job/OpenJPA-2.4.x/ws/openjpa-examples/simple/target/simple-2.4.3-SNAPSHOT.jar> to /home/jenkins/.m2/repository/org/apache/openjpa/openjpa-examples/simple/2.4.3-SNAPSHOT/simple-2.4.3-SNAPSHOT.jar
[INFO] Installing <https://builds.apache.org/job/OpenJPA-2.4.x/ws/openjpa-examples/simple/pom.xml> to /home/jenkins/.m2/repository/org/apache/openjpa/openjpa-examples/simple/2.4.3-SNAPSHOT/simple-2.4.3-SNAPSHOT.pom
[INFO] Installing <https://builds.apache.org/job/OpenJPA-2.4.x/ws/openjpa-examples/simple/target/simple-2.4.3-SNAPSHOT-tests.jar> to /home/jenkins/.m2/repository/org/apache/openjpa/openjpa-examples/simple/2.4.3-SNAPSHOT/simple-2.4.3-SNAPSHOT-tests.jar
[INFO]                                                                        
[INFO] ------------------------------------------------------------------------
[INFO] Building OpenJPA Examples - image-gallery 2.4.3-SNAPSHOT
[INFO] ------------------------------------------------------------------------
[INFO]
[INFO] --- maven-clean-plugin:2.5:clean (default-clean) @ image-gallery ---
[INFO] Deleting <https://builds.apache.org/job/OpenJPA-2.4.x/ws/openjpa-examples/image-gallery/target>
[INFO]
[INFO] --- buildnumber-maven-plugin:1.4:create (default) @ image-gallery ---
[INFO]
[INFO] --- maven-enforcer-plugin:1.3.1:enforce (default) @ image-gallery ---
[INFO]
[INFO] --- maven-checkstyle-plugin:2.9:checkstyle (default) @ image-gallery ---
[INFO] Starting audit...
Audit done.

[WARNING] Unable to locate Source XRef to link to - DISABLED
[INFO]
[INFO] --- maven-remote-resources-plugin:1.5:process (default) @ image-gallery ---
[INFO]
[INFO] --- maven-resources-plugin:2.7:resources (default-resources) @ image-gallery ---
[INFO] Using 'UTF-8' encoding to copy filtered resources.
[INFO] skip non existing resourceDirectory <https://builds.apache.org/job/OpenJPA-2.4.x/ws/openjpa-examples/image-gallery/src/main/resources>
[INFO] Copying 3 resources
[INFO]
[INFO] --- maven-compiler-plugin:3.5.1:compile (default-compile) @ image-gallery ---
[INFO] Nothing to compile - all classes are up to date
[INFO]
[INFO] --- maven-compiler-plugin:3.5.1:testCompile (test-source-compile) @ image-gallery ---
[INFO] Changes detected - recompiling the module!
[INFO] Compiling 12 source files to <https://builds.apache.org/job/OpenJPA-2.4.x/ws/openjpa-examples/image-gallery/target/test-classes>
[INFO]
[INFO] --- maven-resources-plugin:2.7:testResources (default-testResources) @ image-gallery ---
[INFO] Using 'UTF-8' encoding to copy filtered resources.
[INFO] Copying 1 resource
[INFO] Copying 3 resources
[INFO]
[INFO] --- maven-compiler-plugin:3.5.1:testCompile (default-testCompile) @ image-gallery ---
[INFO] Changes detected - recompiling the module!
[INFO] Compiling 12 source files to <https://builds.apache.org/job/OpenJPA-2.4.x/ws/openjpa-examples/image-gallery/target/test-classes>
[INFO]
[INFO] --- openjpa-maven-plugin:2.4.3-SNAPSHOT:test-enhance (enhancer) @ image-gallery ---
1101  BeanValidation  INFO   [main] openjpa.Tool - Enhancer running on type "org.apache.openjpa.example.gallery.model.Location".
---------------------------------------------------
constituent[0]: file:/home/jenkins/tools/maven/apache-maven-3.0.4/lib/plexus-cipher-1.7.jar
constituent[1]: file:/home/jenkins/tools/maven/apache-maven-3.0.4/lib/commons-cli-1.2.jar
constituent[2]: file:/home/jenkins/tools/maven/apache-maven-3.0.4/lib/plexus-sec-dispatcher-1.3.jar
constituent[3]: file:/home/jenkins/tools/maven/apache-maven-3.0.4/lib/maven-artifact-3.0.4.jar
constituent[4]: file:/home/jenkins/tools/maven/apache-maven-3.0.4/lib/maven-model-builder-3.0.4.jar
constituent[5]: file:/home/jenkins/tools/maven/apache-maven-3.0.4/lib/wagon-http-2.2-shaded.jar
constituent[6]: file:/home/jenkins/tools/maven/apache-maven-3.0.4/lib/wagon-file-2.2.jar
constituent[7]: file:/home/jenkins/tools/maven/apache-maven-3.0.4/lib/maven-aether-provider-3.0.4.jar
constituent[8]: file:/home/jenkins/tools/maven/apache-maven-3.0.4/lib/maven-settings-builder-3.0.4.jar
constituent[9]: file:/home/jenkins/tools/maven/apache-maven-3.0.4/lib/sisu-inject-bean-2.3.0.jar
constituent[10]: file:/home/jenkins/tools/maven/apache-maven-3.0.4/lib/aether-impl-1.13.1.jar
constituent[11]: file:/home/jenkins/tools/maven/apache-maven-3.0.4/lib/maven-compat-3.0.4.jar
constituent[12]: file:/home/jenkins/tools/maven/apache-maven-3.0.4/lib/maven-embedder-3.0.4.jar
constituent[13]: file:/home/jenkins/tools/maven/apache-maven-3.0.4/lib/maven-settings-3.0.4.jar
constituent[14]: file:/home/jenkins/tools/maven/apache-maven-3.0.4/lib/sisu-guava-0.9.9.jar
constituent[15]: file:/home/jenkins/tools/maven/apache-maven-3.0.4/lib/sisu-inject-plexus-2.3.0.jar
constituent[16]: file:/home/jenkins/tools/maven/apache-maven-3.0.4/lib/plexus-interpolation-1.14.jar
constituent[17]: file:/home/jenkins/tools/maven/apache-maven-3.0.4/lib/maven-model-3.0.4.jar
constituent[18]: file:/home/jenkins/tools/maven/apache-maven-3.0.4/lib/aether-api-1.13.1.jar
constituent[19]: file:/home/jenkins/tools/maven/apache-maven-3.0.4/lib/maven-plugin-api-3.0.4.jar
constituent[20]: file:/home/jenkins/tools/maven/apache-maven-3.0.4/lib/wagon-provider-api-2.2.jar
constituent[21]: file:/home/jenkins/tools/maven/apache-maven-3.0.4/lib/plexus-utils-2.0.6.jar
constituent[22]: file:/home/jenkins/tools/maven/apache-maven-3.0.4/lib/sisu-guice-3.1.0-no_aop.jar
constituent[23]: file:/home/jenkins/tools/maven/apache-maven-3.0.4/lib/maven-repository-metadata-3.0.4.jar
constituent[24]: file:/home/jenkins/tools/maven/apache-maven-3.0.4/lib/maven-core-3.0.4.jar
constituent[25]: file:/home/jenkins/tools/maven/apache-maven-3.0.4/lib/plexus-component-annotations-1.5.5.jar
constituent[26]: file:/home/jenkins/tools/maven/apache-maven-3.0.4/lib/aether-connector-wagon-1.13.1.jar
constituent[27]: file:/home/jenkins/tools/maven/apache-maven-3.0.4/lib/aether-spi-1.13.1.jar
constituent[28]: file:/home/jenkins/tools/maven/apache-maven-3.0.4/lib/aether-util-1.13.1.jar
---------------------------------------------------
Exception in thread "main" java.lang.OutOfMemoryError: PermGen space
Build step 'Execute shell' marked build as failure
Archiving artifacts
Setting ANT_1_9_7_HOME=/home/jenkins/tools/ant/apache-ant-1.9.7
Setting JDK_1_6_LATEST__HOME=/home/jenkins/tools/java/latest1.6
Setting MAVEN_3_0_4_HOME=/home/jenkins/tools/maven/apache-maven-3.0.4
[Fast Archiver] No prior successful build to compare, so performing full copy of artifacts
Recording test results
Setting ANT_1_9_7_HOME=/home/jenkins/tools/ant/apache-ant-1.9.7
Setting JDK_1_6_LATEST__HOME=/home/jenkins/tools/java/latest1.6
Setting MAVEN_3_0_4_HOME=/home/jenkins/tools/maven/apache-maven-3.0.4
Setting ANT_1_9_7_HOME=/home/jenkins/tools/ant/apache-ant-1.9.7
Setting JDK_1_6_LATEST__HOME=/home/jenkins/tools/java/latest1.6
Setting MAVEN_3_0_4_HOME=/home/jenkins/tools/maven/apache-maven-3.0.4
Reply | Threaded
Open this post in threaded view
|  
Report Content as Inappropriate

Build failed in Jenkins: OpenJPA-2.4.x #5

Apache Jenkins Server-2
See <https://builds.apache.org/job/OpenJPA-2.4.x/5/display/redirect>

------------------------------------------
Started by user jgrassel
[EnvInject] - Loading node environment variables.
Building remotely on ubuntu-eu2 (ubuntu trusty) in workspace <https://builds.apache.org/job/OpenJPA-2.4.x/ws/>
Updating https://svn.apache.org/repos/asf/openjpa/branches/2.4.x at revision '2017-07-19T20:49:14.281 +0000'
At revision 1802429

No changes for https://svn.apache.org/repos/asf/openjpa/branches/2.4.x since the previous build
Setting ANT_1_9_7_HOME=/home/jenkins/tools/ant/apache-ant-1.9.7
Setting JDK_1_6_LATEST__HOME=/home/jenkins/tools/java/latest1.6
Setting MAVEN_3_3_3_HOME=/home/jenkins/tools/maven/apache-maven-3.3.3
[OpenJPA-2.4.x] $ /bin/bash -xe /tmp/jenkins1227626093534843055.sh
+ export ANT_HOME=/home/jenkins/tools/ant/apache-ant-1.9.7
+ ANT_HOME=/home/jenkins/tools/ant/apache-ant-1.9.7
+ export JAVA_HOME=/home/jenkins/tools/java/latest1.6
+ JAVA_HOME=/home/jenkins/tools/java/latest1.6
+ export M2_HOME=/home/jenkins/tools/maven/apache-maven-3.3.3
+ M2_HOME=/home/jenkins/tools/maven/apache-maven-3.3.3
+ export PATH=/home/jenkins/tools/ant/apache-ant-1.9.7/bin:/home/jenkins/tools/java/latest1.6/bin:/home/jenkins/tools/maven/apache-maven-3.3.3/bin:/home/jenkins/tools/java/latest1.6/bin:/usr/local/sbin:/usr/local/bin:/usr/sbin:/usr/bin:/sbin:/bin:/usr/games:/usr/local/games
+ PATH=/home/jenkins/tools/ant/apache-ant-1.9.7/bin:/home/jenkins/tools/java/latest1.6/bin:/home/jenkins/tools/maven/apache-maven-3.3.3/bin:/home/jenkins/tools/java/latest1.6/bin:/usr/local/sbin:/usr/local/bin:/usr/sbin:/usr/bin:/sbin:/bin:/usr/games:/usr/local/games
+ export MAVEN_OPTS=-Xmx4096m
+ MAVEN_OPTS=-Xmx4096m
+ java -version
java version "1.6.0_45"
Java(TM) SE Runtime Environment (build 1.6.0_45-b06)
Java HotSpot(TM) 64-Bit Server VM (build 20.45-b01, mixed mode)
+ mvn clean install
Exception in thread "main" java.lang.UnsupportedClassVersionError: org/apache/maven/cli/MavenCli : Unsupported major.minor version 51.0
        at java.lang.ClassLoader.defineClass1(Native Method)
        at java.lang.ClassLoader.defineClassCond(ClassLoader.java:631)
        at java.lang.ClassLoader.defineClass(ClassLoader.java:615)
        at java.security.SecureClassLoader.defineClass(SecureClassLoader.java:141)
        at java.net.URLClassLoader.defineClass(URLClassLoader.java:283)
        at java.net.URLClassLoader.access$000(URLClassLoader.java:58)
        at java.net.URLClassLoader$1.run(URLClassLoader.java:197)
        at java.security.AccessController.doPrivileged(Native Method)
        at java.net.URLClassLoader.findClass(URLClassLoader.java:190)
        at org.codehaus.plexus.classworlds.realm.ClassRealm.loadClassFromSelf(ClassRealm.java:401)
        at org.codehaus.plexus.classworlds.strategy.SelfFirstStrategy.loadClass(SelfFirstStrategy.java:42)
        at org.codehaus.plexus.classworlds.realm.ClassRealm.unsynchronizedLoadClass(ClassRealm.java:271)
        at org.codehaus.plexus.classworlds.realm.ClassRealm.loadClass(ClassRealm.java:254)
        at org.codehaus.plexus.classworlds.realm.ClassRealm.loadClass(ClassRealm.java:239)
        at org.codehaus.plexus.classworlds.launcher.Launcher.getMainClass(Launcher.java:144)
        at org.codehaus.plexus.classworlds.launcher.Launcher.launchEnhanced(Launcher.java:266)
        at org.codehaus.plexus.classworlds.launcher.Launcher.launch(Launcher.java:229)
        at org.codehaus.plexus.classworlds.launcher.Launcher.mainWithExitCode(Launcher.java:415)
        at org.codehaus.plexus.classworlds.launcher.Launcher.main(Launcher.java:356)
Build step 'Execute shell' marked build as failure
Archiving artifacts
Setting ANT_1_9_7_HOME=/home/jenkins/tools/ant/apache-ant-1.9.7
Setting JDK_1_6_LATEST__HOME=/home/jenkins/tools/java/latest1.6
Setting MAVEN_3_3_3_HOME=/home/jenkins/tools/maven/apache-maven-3.3.3
[Fast Archiver] No prior successful build to compare, so performing full copy of artifacts
Recording test results
Setting ANT_1_9_7_HOME=/home/jenkins/tools/ant/apache-ant-1.9.7
Setting JDK_1_6_LATEST__HOME=/home/jenkins/tools/java/latest1.6
Setting MAVEN_3_3_3_HOME=/home/jenkins/tools/maven/apache-maven-3.3.3
ERROR: Step ‘Publish JUnit test result report’ failed: Test reports were found but none of them are new. Did tests run?
For example, <https://builds.apache.org/job/OpenJPA-2.4.x/ws/openjpa-jdbc/target/surefire-reports/TEST-org.apache.openjpa.jdbc.kernel.TestSQLStoreParamsSubstitution.xml> is 1 hr 16 min old

Setting ANT_1_9_7_HOME=/home/jenkins/tools/ant/apache-ant-1.9.7
Setting JDK_1_6_LATEST__HOME=/home/jenkins/tools/java/latest1.6
Setting MAVEN_3_3_3_HOME=/home/jenkins/tools/maven/apache-maven-3.3.3
Reply | Threaded
Open this post in threaded view
|  
Report Content as Inappropriate

Jenkins build is back to normal : OpenJPA-2.4.x #6

Apache Jenkins Server-2
Loading...