Build failed in Jenkins: OpenJPA-Trunk-Deploy #27

classic Classic list List threaded Threaded
1 message Options
Reply | Threaded
Open this post in threaded view
|

Build failed in Jenkins: OpenJPA-Trunk-Deploy #27

Apache Jenkins Server-2
See <https://builds.apache.org/job/OpenJPA-Trunk-Deploy/27/display/redirect>

------------------------------------------
Started by user ilgrosso
[EnvInject] - Loading node environment variables.
Building remotely on H25 (ubuntu xenial) in workspace <https://builds.apache.org/job/OpenJPA-Trunk-Deploy/ws/>
Cloning the remote Git repository
Cloning repository https://gitbox.apache.org/repos/asf/openjpa.git
 > git init <https://builds.apache.org/job/OpenJPA-Trunk-Deploy/ws/> # timeout=10
Fetching upstream changes from https://gitbox.apache.org/repos/asf/openjpa.git
 > git --version # timeout=10
 > git fetch --tags --progress https://gitbox.apache.org/repos/asf/openjpa.git +refs/heads/*:refs/remotes/origin/*
 > git config remote.origin.url https://gitbox.apache.org/repos/asf/openjpa.git # timeout=10
 > git config --add remote.origin.fetch +refs/heads/*:refs/remotes/origin/* # timeout=10
 > git config remote.origin.url https://gitbox.apache.org/repos/asf/openjpa.git # timeout=10
Fetching upstream changes from https://gitbox.apache.org/repos/asf/openjpa.git
 > git fetch --tags --progress https://gitbox.apache.org/repos/asf/openjpa.git +refs/heads/*:refs/remotes/origin/*
 > git rev-parse refs/remotes/origin/master^{commit} # timeout=10
 > git rev-parse refs/remotes/origin/origin/master^{commit} # timeout=10
Checking out Revision 9eb7e2b14521ba8aa40153c4d02f0a40def92b51 (refs/remotes/origin/master)
 > git config core.sparsecheckout # timeout=10
 > git checkout -f 9eb7e2b14521ba8aa40153c4d02f0a40def92b51
Commit message: "OPENJPA-2753 add a profile test-mariadb-docker"
First time build. Skipping changelog.
Setting ANT_1_9_7_HOME=/home/jenkins/tools/ant/apache-ant-1.9.7
Setting MAVEN_3_0_4_HOME=/home/jenkins/tools/maven/apache-maven-3.0.4
Setting JDK_1_8_LATEST__HOME=/home/jenkins/tools/java/latest1.8
[OpenJPA-Trunk-Deploy] $ /bin/bash -xe /tmp/jenkins5544758259980080616.sh
+ export ANT_HOME=/home/jenkins/tools/ant/apache-ant-1.9.7
+ ANT_HOME=/home/jenkins/tools/ant/apache-ant-1.9.7
+ export JAVA_HOME=/home/jenkins/tools/java/latest1.8
+ JAVA_HOME=/home/jenkins/tools/java/latest1.8
+ export M2_HOME=/home/jenkins/tools/maven/apache-maven-3.0.4
+ M2_HOME=/home/jenkins/tools/maven/apache-maven-3.0.4
+ export PATH=/home/jenkins/tools/ant/apache-ant-1.9.7/bin:/home/jenkins/tools/java/latest1.8/bin:/home/jenkins/tools/maven/apache-maven-3.0.4/bin:/home/jenkins/tools/java/latest1.8/bin:/usr/local/sbin:/usr/local/bin:/usr/sbin:/usr/bin:/sbin:/bin:/snap/bin
+ PATH=/home/jenkins/tools/ant/apache-ant-1.9.7/bin:/home/jenkins/tools/java/latest1.8/bin:/home/jenkins/tools/maven/apache-maven-3.0.4/bin:/home/jenkins/tools/java/latest1.8/bin:/usr/local/sbin:/usr/local/bin:/usr/sbin:/usr/bin:/sbin:/bin:/snap/bin
+ mvn clean deploy
[INFO] Scanning for projects...
[INFO] ------------------------------------------------------------------------
[INFO] Reactor Build Order:
[INFO]
[INFO] OpenJPA Parent POM
[INFO] OpenJPA Utilities Library
[INFO] OpenJPA Kernel
[INFO] OpenJPA JDBC
[INFO] OpenJPA Persistence
[INFO] OpenJPA Persistence JDBC
[INFO] OpenJPA Persistence Locking Tests
[INFO] OpenJPA tools
[INFO] OpenJPA Maven Plugin
[INFO] OpenJPA XML Store
[INFO] OpenJPA Slice
[INFO] OpenJPA JEST
[INFO] OpenJPA Aggregate Jar
[INFO] OpenJPA Aggregate Jar with Dependencies
[INFO] OpenJPA Project Docs and Assemblies
[INFO] OpenJPA Examples
[INFO] OpenJPA Examples - Simple
[INFO] OpenJPA Examples - image-gallery
[INFO] OpenJPA Examples - OpenBooks
[INFO] OpenJPA Integration Tests
[INFO] OpenJPA Integration Tests - Daytrader
[INFO] OpenJPA Integration Tests - Examples
[INFO] OpenJPA Integration Tests - SLF4JLogFactory
[INFO] OpenJPA Integration Tests - JPA TCK
[INFO] OpenJPA Integration Tests - Bean Validation
[INFO] OpenJPA Integration Tests - JMX Platform MBeans
[INFO] OpenJPA Fetching Statistic Tool
[INFO] OpenJPA Fetching Statistic Tool -- WAS Bundle
[INFO] OpenJPA Features
[INFO]                                                                        
[INFO] ------------------------------------------------------------------------
[INFO] Building OpenJPA Parent POM 3.0.1-SNAPSHOT
[INFO] ------------------------------------------------------------------------
Downloading: http://repository.apache.org/snapshots/org/apache/commons/commons-dbcp2/2.6.0-SNAPSHOT/maven-metadata.xml
2/2 KB            Downloaded: http://repository.apache.org/snapshots/org/apache/commons/commons-dbcp2/2.6.0-SNAPSHOT/maven-metadata.xml (2 KB at 3.7 KB/sec)
Downloading: http://repository.apache.org/snapshots/org/apache/commons/commons-dbcp2/2.6.0-SNAPSHOT/commons-dbcp2-2.6.0-20181114.155910-27.pom
4/18 KB   8/18 KB   12/18 KB   14/18 KB   18/18 KB              Downloaded: http://repository.apache.org/snapshots/org/apache/commons/commons-dbcp2/2.6.0-SNAPSHOT/commons-dbcp2-2.6.0-20181114.155910-27.pom (18 KB at 49.0 KB/sec)
Downloading: http://repository.apache.org/snapshots/org/apache/commons/commons-pool2/2.6.1-SNAPSHOT/maven-metadata.xml
2/2 KB              Downloaded: http://repository.apache.org/snapshots/org/apache/commons/commons-pool2/2.6.1-SNAPSHOT/maven-metadata.xml (2 KB at 4.6 KB/sec)
Downloading: http://repository.apache.org/snapshots/org/apache/commons/commons-pool2/2.6.1-SNAPSHOT/commons-pool2-2.6.1-20181027.190922-2.pom
4/15 KB   6/15 KB   10/15 KB   14/15 KB   15/15 KB              Downloaded: http://repository.apache.org/snapshots/org/apache/commons/commons-pool2/2.6.1-SNAPSHOT/commons-pool2-2.6.1-20181027.190922-2.pom (15 KB at 48.6 KB/sec)
Downloading: http://repository.apache.org/snapshots/org/apache/commons/commons-dbcp2/2.6.0-SNAPSHOT/commons-dbcp2-2.6.0-20181114.155910-27.jar
Downloading: http://repository.apache.org/snapshots/org/apache/commons/commons-pool2/2.6.1-SNAPSHOT/commons-pool2-2.6.1-20181027.190922-2.jar
4/201 KB   8/201 KB   12/201 KB   14/201 KB   3/128 KB   14/201 KB   7/128 KB   14/201 KB   11/128 KB   14/201 KB   14/128 KB   14/201 KB   14/128 KB   18/201 KB   14/128 KB   22/201 KB   14/128 KB   26/201 KB   14/128 KB   30/201 KB   14/128 KB   34/201 KB   14/128 KB   38/201 KB   14/128 KB   42/201 KB   14/128 KB   42/201 KB   18/128 KB   42/201 KB   20/128 KB   42/201 KB   24/128 KB   42/201 KB   28/128 KB   42/201 KB   31/128 KB   42/201 KB   35/128 KB   42/201 KB   39/128 KB   42/201 KB   42/128 KB   42/201 KB   42/128 KB   45/201 KB   42/128 KB   49/201 KB   42/128 KB   53/201 KB   42/128 KB   57/201 KB   42/128 KB   61/201 KB   42/128 KB   65/201 KB   42/128 KB   69/201 KB   42/128 KB   73/201 KB   42/128 KB   77/201 KB   42/128 KB   81/201 KB   42/128 KB   85/201 KB   42/128 KB   89/201 KB   42/128 KB   93/201 KB   42/128 KB   97/201 KB   42/128 KB   98/201 KB   46/128 KB   98/201 KB   50/128 KB   98/201 KB   54/128 KB   98/201 KB   58/128 KB   98/201 KB   62/128 KB   98/201 KB   66/128 KB   98/201 KB   70/128 KB   98/201 KB   74/128 KB   98/201 KB   78/128 KB   98/201 KB   82/128 KB   98/201 KB   86/128 KB   98/201 KB   90/128 KB   98/201 KB   94/128 KB   98/201 KB   98/128 KB   98/201 KB   99/128 KB   98/201 KB   99/128 KB   102/201 KB   99/128 KB   106/201 KB   99/128 KB   110/201 KB   99/128 KB   114/201 KB   99/128 KB   118/201 KB   99/128 KB   122/201 KB   99/128 KB   126/201 KB   99/128 KB   130/201 KB   99/128 KB   134/201 KB   99/128 KB   138/201 KB   99/128 KB   142/201 KB   99/128 KB   146/201 KB   99/128 KB   150/201 KB   99/128 KB   154/201 KB   99/128 KB   158/201 KB   99/128 KB   162/201 KB   99/128 KB   166/201 KB   99/128 KB   170/201 KB   99/128 KB   174/201 KB   99/128 KB   178/201 KB   99/128 KB   182/201 KB   99/128 KB   186/201 KB   99/128 KB   190/201 KB   99/128 KB   194/201 KB   99/128 KB   198/201 KB   99/128 KB   201/201 KB   102/128 KB   201/201 KB   106/128 KB   201/201 KB   110/128 KB   201/201 KB   114/128 KB   201/201 KB   118/128 KB   201/201 KB   122/128 KB   201/201 KB   126/128 KB   201/201 KB   128/128 KB   201/201 KB                             Downloaded: http://repository.apache.org/snapshots/org/apache/commons/commons-dbcp2/2.6.0-SNAPSHOT/commons-dbcp2-2.6.0-20181114.155910-27.jar (201 KB at 398.5 KB/sec)
                          Downloaded: http://repository.apache.org/snapshots/org/apache/commons/commons-pool2/2.6.1-SNAPSHOT/commons-pool2-2.6.1-20181027.190922-2.jar (128 KB at 252.4 KB/sec)
[INFO]
[INFO] --- maven-clean-plugin:3.1.0:clean (default-clean) @ openjpa-parent ---
[INFO]
[INFO] --- buildnumber-maven-plugin:1.4:create (default) @ openjpa-parent ---
[INFO] Executing: /bin/sh -c cd '<https://builds.apache.org/job/OpenJPA-Trunk-Deploy/ws/'> && 'git' 'rev-parse' '--verify' 'HEAD'
[INFO] Working directory: <https://builds.apache.org/job/OpenJPA-Trunk-Deploy/ws/>
[INFO] Storing buildNumber: 9eb7e2b14521ba8aa40153c4d02f0a40def92b51 at timestamp: November 30, 2018 at 1:15 PM
[WARNING] Cannot get the branch information from the git repository:
Detecting the current branch failed: fatal: ref HEAD is not a symbolic ref

[INFO] Executing: /bin/sh -c cd '<https://builds.apache.org/job/OpenJPA-Trunk-Deploy/ws/'> && 'git' 'rev-parse' '--verify' 'HEAD'
[INFO] Working directory: <https://builds.apache.org/job/OpenJPA-Trunk-Deploy/ws/>
[INFO] Storing buildScmBranch: UNKNOWN
[INFO]
[INFO] --- maven-enforcer-plugin:1.4.1:enforce (enforce-maven-version) @ openjpa-parent ---
[WARNING] Rule 0: org.apache.maven.plugins.enforcer.RequireMavenVersion failed with message:
Detected Maven Version: 3.0.4 is not in the allowed range 3.0.5.
[INFO] ------------------------------------------------------------------------
[INFO] Reactor Summary:
[INFO]
[INFO] OpenJPA Parent POM ................................ FAILURE [2.918s]
[INFO] OpenJPA Utilities Library ......................... SKIPPED
[INFO] OpenJPA Kernel .................................... SKIPPED
[INFO] OpenJPA JDBC ...................................... SKIPPED
[INFO] OpenJPA Persistence ............................... SKIPPED
[INFO] OpenJPA Persistence JDBC .......................... SKIPPED
[INFO] OpenJPA Persistence Locking Tests ................. SKIPPED
[INFO] OpenJPA tools ..................................... SKIPPED
[INFO] OpenJPA Maven Plugin .............................. SKIPPED
[INFO] OpenJPA XML Store ................................. SKIPPED
[INFO] OpenJPA Slice ..................................... SKIPPED
[INFO] OpenJPA JEST ...................................... SKIPPED
[INFO] OpenJPA Aggregate Jar ............................. SKIPPED
[INFO] OpenJPA Aggregate Jar with Dependencies ........... SKIPPED
[INFO] OpenJPA Project Docs and Assemblies ............... SKIPPED
[INFO] OpenJPA Examples .................................. SKIPPED
[INFO] OpenJPA Examples - Simple ......................... SKIPPED
[INFO] OpenJPA Examples - image-gallery .................. SKIPPED
[INFO] OpenJPA Examples - OpenBooks ...................... SKIPPED
[INFO] OpenJPA Integration Tests ......................... SKIPPED
[INFO] OpenJPA Integration Tests - Daytrader ............. SKIPPED
[INFO] OpenJPA Integration Tests - Examples .............. SKIPPED
[INFO] OpenJPA Integration Tests - SLF4JLogFactory ....... SKIPPED
[INFO] OpenJPA Integration Tests - JPA TCK ............... SKIPPED
[INFO] OpenJPA Integration Tests - Bean Validation ....... SKIPPED
[INFO] OpenJPA Integration Tests - JMX Platform MBeans ... SKIPPED
[INFO] OpenJPA Fetching Statistic Tool ................... SKIPPED
[INFO] OpenJPA Fetching Statistic Tool -- WAS Bundle ..... SKIPPED
[INFO] OpenJPA Features .................................. SKIPPED
[INFO] ------------------------------------------------------------------------
[INFO] BUILD FAILURE
[INFO] ------------------------------------------------------------------------
[INFO] Total time: 4.030s
[INFO] Finished at: Fri Nov 30 13:15:10 UTC 2018
[INFO] Final Memory: 23M/1447M
[INFO] ------------------------------------------------------------------------
[ERROR] Failed to execute goal org.apache.maven.plugins:maven-enforcer-plugin:1.4.1:enforce (enforce-maven-version) on project openjpa-parent: Some Enforcer rules have failed. Look above for specific messages explaining why the rule failed. -> [Help 1]
[ERROR]
[ERROR] To see the full stack trace of the errors, re-run Maven with the -e switch.
[ERROR] Re-run Maven using the -X switch to enable full debug logging.
[ERROR]
[ERROR] For more information about the errors and possible solutions, please read the following articles:
[ERROR] [Help 1] http://cwiki.apache.org/confluence/display/MAVEN/MojoExecutionException
Build step 'Execute shell' marked build as failure
Archiving artifacts
Setting ANT_1_9_7_HOME=/home/jenkins/tools/ant/apache-ant-1.9.7
Setting MAVEN_3_0_4_HOME=/home/jenkins/tools/maven/apache-maven-3.0.4
Setting JDK_1_8_LATEST__HOME=/home/jenkins/tools/java/latest1.8
Recording test results
Setting ANT_1_9_7_HOME=/home/jenkins/tools/ant/apache-ant-1.9.7
Setting MAVEN_3_0_4_HOME=/home/jenkins/tools/maven/apache-maven-3.0.4
Setting JDK_1_8_LATEST__HOME=/home/jenkins/tools/java/latest1.8
ERROR: Step ?Publish JUnit test result report? failed: No test report files were found. Configuration error?
Setting ANT_1_9_7_HOME=/home/jenkins/tools/ant/apache-ant-1.9.7
Setting MAVEN_3_0_4_HOME=/home/jenkins/tools/maven/apache-maven-3.0.4
Setting JDK_1_8_LATEST__HOME=/home/jenkins/tools/java/latest1.8