Build failed in Jenkins: OpenJPA-Trunk-Deploy #40

classic Classic list List threaded Threaded
2 messages Options
Reply | Threaded
Open this post in threaded view
|

Build failed in Jenkins: OpenJPA-Trunk-Deploy #40

Apache Jenkins Server-2
See <https://builds.apache.org/job/OpenJPA-Trunk-Deploy/40/display/redirect?page=changes>

Changes:

[struberg] OPENJPA-2754 re-enable dbcp2 auto detection

[struberg] add missing port to postgresql config

[struberg] OPENJPA-2753 improve postgresql docker setup

------------------------------------------
Started by an SCM change
[EnvInject] - Loading node environment variables.
Building remotely on H23 (ubuntu xenial) in workspace <https://builds.apache.org/job/OpenJPA-Trunk-Deploy/ws/>
Cloning the remote Git repository
Cloning repository https://gitbox.apache.org/repos/asf/openjpa.git
 > git init <https://builds.apache.org/job/OpenJPA-Trunk-Deploy/ws/> # timeout=10
Fetching upstream changes from https://gitbox.apache.org/repos/asf/openjpa.git
 > git --version # timeout=10
 > git fetch --tags --progress https://gitbox.apache.org/repos/asf/openjpa.git +refs/heads/*:refs/remotes/origin/*
 > git config remote.origin.url https://gitbox.apache.org/repos/asf/openjpa.git # timeout=10
 > git config --add remote.origin.fetch +refs/heads/*:refs/remotes/origin/* # timeout=10
 > git config remote.origin.url https://gitbox.apache.org/repos/asf/openjpa.git # timeout=10
Fetching upstream changes from https://gitbox.apache.org/repos/asf/openjpa.git
 > git fetch --tags --progress https://gitbox.apache.org/repos/asf/openjpa.git +refs/heads/*:refs/remotes/origin/*
 > git rev-parse refs/remotes/origin/master^{commit} # timeout=10
 > git rev-parse refs/remotes/origin/origin/master^{commit} # timeout=10
Checking out Revision d25ed12902c1ee4f156e6aba2b715de148be131c (refs/remotes/origin/master)
 > git config core.sparsecheckout # timeout=10
 > git checkout -f d25ed12902c1ee4f156e6aba2b715de148be131c
Commit message: "OPENJPA-2753 improve postgresql docker setup"
 > git rev-list --no-walk d3790f70c7d8a0e7a85c1ad95730605c33c4d818 # timeout=10
Setting ANT_1_9_7_HOME=/home/jenkins/tools/ant/apache-ant-1.9.7
Setting MAVEN_3_0_4_HOME=/home/jenkins/tools/maven/apache-maven-3.0.4
Setting JDK_1_8_LATEST__HOME=/home/jenkins/tools/java/latest1.8
Setting MAVEN_3_5_4_HOME=/home/jenkins/tools/maven/apache-maven-3.5.4
[OpenJPA-Trunk-Deploy] $ /bin/bash -xe /tmp/jenkins8521231832254590242.sh
+ export ANT_HOME=/home/jenkins/tools/ant/apache-ant-1.9.7
+ ANT_HOME=/home/jenkins/tools/ant/apache-ant-1.9.7
+ export JAVA_HOME=/home/jenkins/tools/java/latest1.8
+ JAVA_HOME=/home/jenkins/tools/java/latest1.8
+ export M2_HOME=/home/jenkins/tools/maven/apache-maven-3.5.4
+ M2_HOME=/home/jenkins/tools/maven/apache-maven-3.5.4
+ export PATH=/home/jenkins/tools/ant/apache-ant-1.9.7/bin:/home/jenkins/tools/java/latest1.8/bin:/home/jenkins/tools/maven/apache-maven-3.5.4/bin:/home/jenkins/tools/java/latest1.8/bin:/usr/local/sbin:/usr/local/bin:/usr/sbin:/usr/bin:/sbin:/bin:/snap/bin
+ PATH=/home/jenkins/tools/ant/apache-ant-1.9.7/bin:/home/jenkins/tools/java/latest1.8/bin:/home/jenkins/tools/maven/apache-maven-3.5.4/bin:/home/jenkins/tools/java/latest1.8/bin:/usr/local/sbin:/usr/local/bin:/usr/sbin:/usr/bin:/sbin:/bin:/snap/bin
+ mvn clean deploy -DskipTests
[INFO] Scanning for projects...
[INFO] ------------------------------------------------------------------------
[INFO] Reactor Build Order:
[INFO]
[INFO] OpenJPA Parent POM                                                 [pom]
[INFO] OpenJPA Utilities Library                                          [jar]
[INFO] OpenJPA Kernel                                                     [jar]
[INFO] OpenJPA JDBC                                                       [jar]
[INFO] OpenJPA Persistence                                                [jar]
[INFO] OpenJPA Persistence JDBC                                           [jar]
[INFO] OpenJPA Persistence Locking Tests                                  [jar]
[INFO] OpenJPA tools                                                      [pom]
[INFO] OpenJPA Maven Plugin                                      [maven-plugin]
[INFO] OpenJPA XML Store                                                  [jar]
[INFO] OpenJPA Slice                                                      [jar]
[INFO] OpenJPA JEST                                                       [jar]
[INFO] OpenJPA Aggregate Jar                                           [bundle]
[INFO] OpenJPA Aggregate Jar with Dependencies                            [jar]
[INFO] OpenJPA Project Docs and Assemblies                                [pom]
[INFO] OpenJPA Examples                                                   [pom]
[INFO] OpenJPA Examples - Simple                                          [jar]
[INFO] OpenJPA Examples - image-gallery                                   [jar]
[INFO] OpenJPA Examples - OpenBooks                                       [jar]
[INFO] OpenJPA Integration Tests                                          [pom]
[INFO] OpenJPA Integration Tests - Daytrader                              [jar]
[INFO] OpenJPA Integration Tests - Examples                               [pom]
[INFO] OpenJPA Integration Tests - SLF4JLogFactory                        [jar]
[INFO] OpenJPA Integration Tests - JPA TCK                                [pom]
[INFO] OpenJPA Integration Tests - Bean Validation                        [jar]
[INFO] OpenJPA Integration Tests - JMX Platform MBeans                    [jar]
[INFO] OpenJPA Fetching Statistic Tool                                    [jar]
[INFO] OpenJPA Fetching Statistic Tool -- WAS Bundle                      [jar]
[INFO] OpenJPA Features                                                   [pom]
[INFO]
[INFO] -----------------< org.apache.openjpa:openjpa-parent >------------------
[INFO] Building OpenJPA Parent POM 3.0.1-SNAPSHOT                        [1/29]
[INFO] --------------------------------[ pom ]---------------------------------
Downloading from central: https://repo.maven.apache.org/maven2/org/apache/commons/commons-dbcp2/2.5.0/commons-dbcp2-2.5.0.pom
Progress (1): 2.2/18 kBProgress (1): 5.0/18 kBProgress (1): 7.8/18 kBProgress (1): 11/18 kB Progress (1): 13/18 kBProgress (1): 16/18 kBProgress (1): 18 kB                      Downloaded from central: https://repo.maven.apache.org/maven2/org/apache/commons/commons-dbcp2/2.5.0/commons-dbcp2-2.5.0.pom (18 kB at 69 kB/s)
Downloading from central: https://repo.maven.apache.org/maven2/org/apache/commons/commons-pool2/2.6.0/commons-pool2-2.6.0.pom
Progress (1): 2.2/15 kBProgress (1): 5.0/15 kBProgress (1): 7.8/15 kBProgress (1): 11/15 kB Progress (1): 13/15 kBProgress (1): 15 kB                      Downloaded from central: https://repo.maven.apache.org/maven2/org/apache/commons/commons-pool2/2.6.0/commons-pool2-2.6.0.pom (15 kB at 828 kB/s)
Downloading from central: https://repo.maven.apache.org/maven2/org/apache/commons/commons-dbcp2/2.5.0/commons-dbcp2-2.5.0.jar
Downloading from central: https://repo.maven.apache.org/maven2/org/apache/commons/commons-pool2/2.6.0/commons-pool2-2.6.0.jar
Progress (1): 2.2/197 kBProgress (1): 5.0/197 kBProgress (1): 7.7/197 kBProgress (1): 10/197 kB Progress (1): 13/197 kBProgress (1): 16/197 kBProgress (1): 19/197 kBProgress (1): 21/197 kBProgress (1): 24/197 kBProgress (1): 27/197 kBProgress (1): 30/197 kBProgress (1): 32/197 kBProgress (1): 36/197 kBProgress (1): 40/197 kBProgress (1): 45/197 kBProgress (1): 49/197 kBProgress (1): 53/197 kBProgress (1): 57/197 kBProgress (1): 61/197 kBProgress (1): 65/197 kBProgress (1): 69/197 kBProgress (1): 73/197 kBProgress (1): 77/197 kBProgress (1): 81/197 kBProgress (2): 81/197 kB | 2.2/131 kBProgress (2): 85/197 kB | 2.2/131 kBProgress (2): 90/197 kB | 2.2/131 kBProgress (2): 90/197 kB | 5.0/131 kBProgress (2): 94/197 kB | 5.0/131 kBProgress (2): 98/197 kB | 5.0/131 kBProgress (2): 98/197 kB | 7.7/131 kBProgress (2): 98/197 kB | 10/131 kB Progress (2): 102/197 kB | 10/131 kBProgress (2): 102/197 kB | 13/131 kBProgress (2): 106/197 kB | 13/131 kBProgress (2): 106/197 kB | 16/131 kBProgress (2): 110/197 kB | 16/131 kBProgress (2): 114/197 kB | 16/131 kBProgress (2): 114/197 kB | 19/131 kBProgress (2): 114/197 kB | 21/131 kBProgress (2): 118/197 kB | 21/131 kBProgress (2): 122/197 kB | 21/131 kBProgress (2): 122/197 kB | 24/131 kBProgress (2): 126/197 kB | 24/131 kBProgress (2): 131/197 kB | 24/131 kBProgress (2): 131/197 kB | 27/131 kBProgress (2): 131/197 kB | 30/131 kBProgress (2): 135/197 kB | 30/131 kBProgress (2): 135/197 kB | 32/131 kBProgress (2): 139/197 kB | 32/131 kBProgress (2): 143/197 kB | 32/131 kBProgress (2): 147/197 kB | 32/131 kBProgress (2): 147/197 kB | 36/131 kBProgress (2): 147/197 kB | 40/131 kBProgress (2): 151/197 kB | 40/131 kBProgress (2): 151/197 kB | 45/131 kBProgress (2): 155/197 kB | 45/131 kBProgress (2): 155/197 kB | 49/131 kBProgress (2): 159/197 kB | 49/131 kBProgress (2): 163/197 kB | 49/131 kBProgress (2): 163/197 kB | 53/131 kBProgress (2): 163/197 kB | 57/131 kBProgress (2): 167/197 kB | 57/131 kBProgress (2): 167/197 kB | 61/131 kBProgress (2): 171/197 kB | 61/131 kBProgress (2): 171/197 kB | 65/131 kBProgress (2): 176/197 kB | 65/131 kBProgress (2): 180/197 kB | 65/131 kBProgress (2): 180/197 kB | 69/131 kBProgress (2): 184/197 kB | 69/131 kBProgress (2): 184/197 kB | 73/131 kBProgress (2): 188/197 kB | 73/131 kBProgress (2): 188/197 kB | 77/131 kBProgress (2): 192/197 kB | 77/131 kBProgress (2): 192/197 kB | 81/131 kBProgress (2): 196/197 kB | 81/131 kBProgress (2): 197 kB | 81/131 kB    Progress (2): 197 kB | 85/131 kBProgress (2): 197 kB | 90/131 kBProgress (2): 197 kB | 94/131 kBProgress (2): 197 kB | 98/131 kBProgress (2): 197 kB | 102/131 kBProgress (2): 197 kB | 106/131 kBProgress (2): 197 kB | 110/131 kBProgress (2): 197 kB | 114/131 kBProgress (2): 197 kB | 118/131 kBProgress (2): 197 kB | 122/131 kBProgress (2): 197 kB | 126/131 kB                                 Downloaded from central: https://repo.maven.apache.org/maven2/org/apache/commons/commons-dbcp2/2.5.0/commons-dbcp2-2.5.0.jar (197 kB at 3.2 MB/s)
Progress (1): 131/131 kBProgress (1): 131 kB                        Downloaded from central: https://repo.maven.apache.org/maven2/org/apache/commons/commons-pool2/2.6.0/commons-pool2-2.6.0.jar (131 kB at 1.8 MB/s)
[INFO]
[INFO] --- maven-clean-plugin:3.1.0:clean (default-clean) @ openjpa-parent ---
[INFO]
[INFO] --- buildnumber-maven-plugin:1.4:create (default) @ openjpa-parent ---
[INFO] Executing: /bin/sh -c cd '<https://builds.apache.org/job/OpenJPA-Trunk-Deploy/ws/'> && 'git' 'rev-parse' '--verify' 'HEAD'
[INFO] Working directory: <https://builds.apache.org/job/OpenJPA-Trunk-Deploy/ws/>
[INFO] Storing buildNumber: d25ed12902c1ee4f156e6aba2b715de148be131c at timestamp: January 2, 2019 at 11:17 PM
[WARNING] Cannot get the branch information from the git repository:
Detecting the current branch failed: fatal: ref HEAD is not a symbolic ref

[INFO] Executing: /bin/sh -c cd '<https://builds.apache.org/job/OpenJPA-Trunk-Deploy/ws/'> && 'git' 'rev-parse' '--verify' 'HEAD'
[INFO] Working directory: <https://builds.apache.org/job/OpenJPA-Trunk-Deploy/ws/>
[INFO] Storing buildScmBranch: UNKNOWN
[INFO]
[INFO] --- maven-enforcer-plugin:1.4.1:enforce (enforce-maven-version) @ openjpa-parent ---
[INFO]
[INFO] --- maven-enforcer-plugin:1.4.1:enforce (default) @ openjpa-parent ---
[INFO]
[INFO] --- maven-checkstyle-plugin:3.0.0:checkstyle (default) @ openjpa-parent ---
Downloading from central: https://repo.maven.apache.org/maven2/com/puppycrawl/tools/checkstyle/6.18/checkstyle-6.18.pom
Progress (1): 2.2/71 kBProgress (1): 5.0/71 kBProgress (1): 7.8/71 kBProgress (1): 11/71 kB Progress (1): 13/71 kBProgress (1): 16/71 kBProgress (1): 19/71 kBProgress (1): 21/71 kBProgress (1): 24/71 kBProgress (1): 27/71 kBProgress (1): 30/71 kBProgress (1): 32/71 kBProgress (1): 36/71 kBProgress (1): 40/71 kBProgress (1): 45/71 kBProgress (1): 49/71 kBProgress (1): 53/71 kBProgress (1): 57/71 kBProgress (1): 61/71 kBProgress (1): 65/71 kBProgress (1): 69/71 kBProgress (1): 71 kB                      Downloaded from central: https://repo.maven.apache.org/maven2/com/puppycrawl/tools/checkstyle/6.18/checkstyle-6.18.pom (71 kB at 3.0 MB/s)
Downloading from central: https://repo.maven.apache.org/maven2/com/puppycrawl/tools/checkstyle/6.18/checkstyle-6.18.jar
Downloading from central: https://repo.maven.apache.org/maven2/org/antlr/antlr4-runtime/4.5.3/antlr4-runtime-4.5.3.jar
Downloaded from central: https://repo.maven.apache.org/maven2/org/antlr/antlr4-runtime/4.5.3/antlr4-runtime-4.5.3.jar (0 B at 0 B/s)
Progress (1): 0/1.2 MBProgress (1): 0/1.2 MBProgress (1): 0/1.2 MBProgress (1): 0/1.2 MBProgress (1): 0/1.2 MBProgress (1): 0/1.2 MBProgress (1): 0/1.2 MBProgress (1): 0/1.2 MBProgress (1): 0/1.2 MBProgress (1): 0/1.2 MBProgress (1): 0/1.2 MBProgress (1): 0/1.2 MBProgress (1): 0.1/1.2 MBProgress (1): 0.1/1.2 MBProgress (1): 0.1/1.2 MBProgress (1): 0.1/1.2 MBProgress (1): 0.1/1.2 MBProgress (1): 0.1/1.2 MBProgress (1): 0.1/1.2 MBProgress (1): 0.1/1.2 MBProgress (1): 0.1/1.2 MBProgress (1): 0.1/1.2 MBProgress (1): 0.1/1.2 MBProgress (1): 0.1/1.2 MBProgress (1): 0.1/1.2 MBProgress (1): 0.1/1.2 MBProgress (1): 0.1/1.2 MBProgress (1): 0.1/1.2 MBProgress (1): 0.1/1.2 MBProgress (1): 0.1/1.2 MBProgress (1): 0.1/1.2 MBProgress (1): 0.1/1.2 MBProgress (1): 0.1/1.2 MBProgress (1): 0.1/1.2 MBProgress (1): 0.1/1.2 MBProgress (1): 0.1/1.2 MBProgress (1): 0.2/1.2 MBProgress (1): 0.2/1.2 MBProgress (1): 0.2/1.2 MBProgress (1): 0.2/1.2 MBProgress (1): 0.2/1.2 MBProgress (1): 0.2/1.2 MBProgress (1): 0.2/1.2 MBProgress (1): 0.2/1.2 MBProgress (1): 0.2/1.2 MBProgress (1): 0.2/1.2 MBProgress (1): 0.2/1.2 MBProgress (1): 0.2/1.2 MBProgress (1): 0.2/1.2 MBProgress (1): 0.2/1.2 MBProgress (1): 0.2/1.2 MBProgress (1): 0.2/1.2 MBProgress (1): 0.2/1.2 MBProgress (1): 0.2/1.2 MBProgress (1): 0.2/1.2 MBProgress (1): 0.2/1.2 MBProgress (1): 0.2/1.2 MBProgress (1): 0.2/1.2 MBProgress (1): 0.2/1.2 MBProgress (1): 0.2/1.2 MBProgress (1): 0.2/1.2 MBProgress (1): 0.3/1.2 MBProgress (1): 0.3/1.2 MBProgress (1): 0.3/1.2 MBProgress (1): 0.3/1.2 MBProgress (1): 0.3/1.2 MBProgress (1): 0.3/1.2 MBProgress (1): 0.3/1.2 MBProgress (1): 0.3/1.2 MBProgress (1): 0.3/1.2 MBProgress (1): 0.3/1.2 MBProgress (1): 0.3/1.2 MBProgress (1): 0.3/1.2 MBProgress (1): 0.3/1.2 MBProgress (1): 0.3/1.2 MBProgress (1): 0.3/1.2 MBProgress (1): 0.3/1.2 MBProgress (1): 0.3/1.2 MBProgress (1): 0.3/1.2 MBProgress (1): 0.3/1.2 MBProgress (1): 0.3/1.2 MBProgress (1): 0.3/1.2 MBProgress (1): 0.3/1.2 MBProgress (1): 0.3/1.2 MBProgress (1): 0.3/1.2 MBProgress (1): 0.4/1.2 MBProgress (1): 0.4/1.2 MBProgress (1): 0.4/1.2 MBProgress (1): 0.4/1.2 MBProgress (1): 0.4/1.2 MBProgress (1): 0.4/1.2 MBProgress (1): 0.4/1.2 MBProgress (1): 0.4/1.2 MBProgress (1): 0.4/1.2 MBProgress (1): 0.4/1.2 MBProgress (1): 0.4/1.2 MBProgress (1): 0.4/1.2 MBProgress (1): 0.4/1.2 MBProgress (1): 0.4/1.2 MBProgress (1): 0.4/1.2 MBProgress (1): 0.4/1.2 MBProgress (1): 0.4/1.2 MBProgress (1): 0.4/1.2 MBProgress (1): 0.4/1.2 MBProgress (1): 0.4/1.2 MBProgress (1): 0.4/1.2 MBProgress (1): 0.4/1.2 MBProgress (1): 0.4/1.2 MBProgress (1): 0.4/1.2 MBProgress (1): 0.5/1.2 MBProgress (1): 0.5/1.2 MBProgress (1): 0.5/1.2 MBProgress (1): 0.5/1.2 MBProgress (1): 0.5/1.2 MBProgress (1): 0.5/1.2 MBProgress (1): 0.5/1.2 MBProgress (1): 0.5/1.2 MBProgress (1): 0.5/1.2 MBProgress (1): 0.5/1.2 MBProgress (1): 0.5/1.2 MBProgress (1): 0.5/1.2 MBProgress (1): 0.5/1.2 MBProgress (1): 0.5/1.2 MBProgress (1): 0.5/1.2 MBProgress (1): 0.5/1.2 MBProgress (1): 0.5/1.2 MBProgress (1): 0.5/1.2 MBProgress (1): 0.5/1.2 MBProgress (1): 0.5/1.2 MBProgress (1): 0.5/1.2 MBProgress (1): 0.5/1.2 MBProgress (1): 0.5/1.2 MBProgress (1): 0.5/1.2 MBProgress (1): 0.5/1.2 MBProgress (1): 0.6/1.2 MBProgress (1): 0.6/1.2 MBProgress (1): 0.6/1.2 MBProgress (1): 0.6/1.2 MBProgress (1): 0.6/1.2 MBProgress (1): 0.6/1.2 MBProgress (1): 0.6/1.2 MBProgress (1): 0.6/1.2 MBProgress (1): 0.6/1.2 MBProgress (1): 0.6/1.2 MBProgress (1): 0.6/1.2 MBProgress (1): 0.6/1.2 MBProgress (1): 0.6/1.2 MBProgress (1): 0.6/1.2 MBProgress (1): 0.6/1.2 MBProgress (1): 0.6/1.2 MBProgress (1): 0.6/1.2 MBProgress (1): 0.6/1.2 MBProgress (1): 0.6/1.2 MBProgress (1): 0.6/1.2 MBProgress (1): 0.6/1.2 MBProgress (1): 0.6/1.2 MBProgress (1): 0.6/1.2 MBProgress (1): 0.6/1.2 MBProgress (1): 0.7/1.2 MBProgress (1): 0.7/1.2 MBProgress (1): 0.7/1.2 MBProgress (1): 0.7/1.2 MBProgress (1): 0.7/1.2 MBProgress (1): 0.7/1.2 MBProgress (1): 0.7/1.2 MBProgress (1): 0.7/1.2 MBProgress (1): 0.7/1.2 MBProgress (1): 0.7/1.2 MBProgress (1): 0.7/1.2 MBProgress (1): 0.7/1.2 MBProgress (1): 0.7/1.2 MBProgress (1): 0.7/1.2 MBProgress (1): 0.7/1.2 MBProgress (1): 0.7/1.2 MBProgress (1): 0.7/1.2 MBProgress (1): 0.7/1.2 MBProgress (1): 0.7/1.2 MBProgress (1): 0.7/1.2 MBProgress (1): 0.7/1.2 MBProgress (1): 0.7/1.2 MBProgress (1): 0.7/1.2 MBProgress (1): 0.7/1.2 MBProgress (1): 0.7/1.2 MBProgress (1): 0.8/1.2 MBProgress (1): 0.8/1.2 MBProgress (1): 0.8/1.2 MBProgress (1): 0.8/1.2 MBProgress (1): 0.8/1.2 MBProgress (1): 0.8/1.2 MBProgress (1): 0.8/1.2 MBProgress (1): 0.8/1.2 MBProgress (1): 0.8/1.2 MBProgress (1): 0.8/1.2 MBProgress (1): 0.8/1.2 MBProgress (1): 0.8/1.2 MBProgress (1): 0.8/1.2 MBProgress (1): 0.8/1.2 MBProgress (1): 0.8/1.2 MBProgress (1): 0.8/1.2 MBProgress (1): 0.8/1.2 MBProgress (1): 0.8/1.2 MBProgress (1): 0.8/1.2 MBProgress (1): 0.8/1.2 MBProgress (1): 0.8/1.2 MBProgress (1): 0.8/1.2 MBProgress (1): 0.8/1.2 MBProgress (1): 0.8/1.2 MBProgress (1): 0.9/1.2 MBProgress (1): 0.9/1.2 MBProgress (1): 0.9/1.2 MBProgress (1): 0.9/1.2 MBProgress (1): 0.9/1.2 MBProgress (1): 0.9/1.2 MBProgress (1): 0.9/1.2 MBProgress (1): 0.9/1.2 MBProgress (1): 0.9/1.2 MBProgress (1): 0.9/1.2 MBProgress (1): 0.9/1.2 MBProgress (1): 0.9/1.2 MBProgress (1): 0.9/1.2 MBProgress (1): 0.9/1.2 MBProgress (1): 0.9/1.2 MBProgress (1): 0.9/1.2 MBProgress (1): 0.9/1.2 MBProgress (1): 0.9/1.2 MBProgress (1): 0.9/1.2 MBProgress (1): 0.9/1.2 MBProgress (1): 0.9/1.2 MBProgress (1): 0.9/1.2 MBProgress (1): 0.9/1.2 MBProgress (1): 0.9/1.2 MBProgress (1): 0.9/1.2 MBProgress (1): 1.0/1.2 MBProgress (1): 1.0/1.2 MBProgress (1): 1.0/1.2 MBProgress (1): 1.0/1.2 MBProgress (1): 1.0/1.2 MBProgress (1): 1.0/1.2 MBProgress (1): 1.0/1.2 MBProgress (1): 1.0/1.2 MBProgress (1): 1.0/1.2 MBProgress (1): 1.0/1.2 MBProgress (1): 1.0/1.2 MBProgress (1): 1.0/1.2 MBProgress (1): 1.0/1.2 MBProgress (1): 1.0/1.2 MBProgress (1): 1.0/1.2 MBProgress (1): 1.0/1.2 MBProgress (1): 1.0/1.2 MBProgress (1): 1.0/1.2 MBProgress (1): 1.0/1.2 MBProgress (1): 1.0/1.2 MBProgress (1): 1.0/1.2 MBProgress (1): 1.0/1.2 MBProgress (1): 1.0/1.2 MBProgress (1): 1.0/1.2 MBProgress (1): 1.1/1.2 MBProgress (1): 1.1/1.2 MBProgress (1): 1.1/1.2 MBProgress (1): 1.1/1.2 MBProgress (1): 1.1/1.2 MBProgress (1): 1.1/1.2 MBProgress (1): 1.1/1.2 MBProgress (1): 1.1/1.2 MBProgress (1): 1.1/1.2 MBProgress (1): 1.1/1.2 MBProgress (1): 1.1/1.2 MBProgress (1): 1.1/1.2 MBProgress (1): 1.1/1.2 MBProgress (1): 1.1/1.2 MBProgress (1): 1.1/1.2 MBProgress (1): 1.1/1.2 MBProgress (1): 1.1/1.2 MBProgress (1): 1.1/1.2 MBProgress (1): 1.1/1.2 MBProgress (1): 1.1/1.2 MBProgress (1): 1.1/1.2 MBProgress (1): 1.1/1.2 MBProgress (1): 1.1/1.2 MBProgress (1): 1.1/1.2 MBProgress (1): 1.2/1.2 MBProgress (1): 1.2/1.2 MBProgress (1): 1.2 MB                        Downloaded from central: https://repo.maven.apache.org/maven2/com/puppycrawl/tools/checkstyle/6.18/checkstyle-6.18.jar (1.2 MB at 8.8 MB/s)
[INFO]
[INFO] --- maven-remote-resources-plugin:1.5:process (process-resource-bundles) @ openjpa-parent ---
[INFO]
[INFO] --- maven-compiler-plugin:3.8.0:testCompile (test-source-compile) @ openjpa-parent ---
[INFO] No sources to compile
[INFO]
[INFO] --- maven-site-plugin:3.7.1:attach-descriptor (attach-descriptor) @ openjpa-parent ---
[INFO] Attaching 'src/site/site.xml' site descriptor with classifier 'site'.
[INFO]
[INFO] --- apache-rat-plugin:0.12:check (default) @ openjpa-parent ---
[INFO] Enabled default license matchers.
[INFO] Will parse SCM ignores for exclusions...
[INFO] Parsing exclusions from <https://builds.apache.org/job/OpenJPA-Trunk-Deploy/ws/.gitignore>
[INFO] Finished adding exclusions from SCM ignore files.
[INFO] 69 implicit excludes (use -debug for more details).
[INFO] Exclude: **/.*/**
[INFO] Exclude: **/target/**/*
[INFO] 4935 resources included (use -debug for more details)
[INFO] Rat check: Summary over all files. Unapproved: 0, unknown: 0, generated: 0, approved: 4926 licenses.
[INFO]
[INFO] --- maven-install-plugin:2.5.2:install (default-install) @ openjpa-parent ---
[INFO] Installing <https://builds.apache.org/job/OpenJPA-Trunk-Deploy/ws/pom.xml> to /home/jenkins/.m2/repository/org/apache/openjpa/openjpa-parent/3.0.1-SNAPSHOT/openjpa-parent-3.0.1-SNAPSHOT.pom
[INFO] Installing <https://builds.apache.org/job/OpenJPA-Trunk-Deploy/ws/target/openjpa-parent-3.0.1-SNAPSHOT-site.xml> to /home/jenkins/.m2/repository/org/apache/openjpa/openjpa-parent/3.0.1-SNAPSHOT/openjpa-parent-3.0.1-SNAPSHOT-site.xml
[INFO]
[INFO] --- maven-deploy-plugin:2.8.2:deploy (default-deploy) @ openjpa-parent ---
Downloading from apache.snapshots.https: https://repository.apache.org/content/repositories/snapshots/org/apache/openjpa/openjpa-parent/3.0.1-SNAPSHOT/maven-metadata.xml
Progress (1): 823 B                   Downloaded from apache.snapshots.https: https://repository.apache.org/content/repositories/snapshots/org/apache/openjpa/openjpa-parent/3.0.1-SNAPSHOT/maven-metadata.xml (823 B at 1.3 kB/s)
Uploading to apache.snapshots.https: https://repository.apache.org/content/repositories/snapshots/org/apache/openjpa/openjpa-parent/3.0.1-SNAPSHOT/openjpa-parent-3.0.1-20190102.231801-26.pom
Progress (1): 2.0/101 kBProgress (1): 4.1/101 kBProgress (1): 6.1/101 kBProgress (1): 8.2/101 kBProgress (1): 10/101 kB Progress (1): 12/101 kBProgress (1): 14/101 kBProgress (1): 16/101 kBProgress (1): 18/101 kBProgress (1): 20/101 kBProgress (1): 23/101 kBProgress (1): 25/101 kBProgress (1): 27/101 kBProgress (1): 29/101 kBProgress (1): 31/101 kBProgress (1): 33/101 kBProgress (1): 35/101 kBProgress (1): 37/101 kBProgress (1): 39/101 kBProgress (1): 41/101 kBProgress (1): 43/101 kBProgress (1): 45/101 kBProgress (1): 47/101 kBProgress (1): 49/101 kBProgress (1): 51/101 kBProgress (1): 53/101 kBProgress (1): 55/101 kBProgress (1): 57/101 kBProgress (1): 59/101 kBProgress (1): 61/101 kBProgress (1): 63/101 kBProgress (1): 66/101 kBProgress (1): 68/101 kBProgress (1): 70/101 kBProgress (1): 72/101 kBProgress (1): 74/101 kBProgress (1): 76/101 kBProgress (1): 78/101 kBProgress (1): 80/101 kBProgress (1): 82/101 kBProgress (1): 84/101 kBProgress (1): 86/101 kBProgress (1): 88/101 kBProgress (1): 90/101 kBProgress (1): 92/101 kBProgress (1): 94/101 kBProgress (1): 96/101 kBProgress (1): 98/101 kBProgress (1): 100/101 kBProgress (1): 101 kB                        Uploaded to apache.snapshots.https: https://repository.apache.org/content/repositories/snapshots/org/apache/openjpa/openjpa-parent/3.0.1-SNAPSHOT/openjpa-parent-3.0.1-20190102.231801-26.pom (101 kB at 74 kB/s)
Downloading from apache.snapshots.https: https://repository.apache.org/content/repositories/snapshots/org/apache/openjpa/openjpa-parent/maven-metadata.xml
Progress (1): 634 B                   Downloaded from apache.snapshots.https: https://repository.apache.org/content/repositories/snapshots/org/apache/openjpa/openjpa-parent/maven-metadata.xml (634 B at 1.0 kB/s)
Uploading to apache.snapshots.https: https://repository.apache.org/content/repositories/snapshots/org/apache/openjpa/openjpa-parent/3.0.1-SNAPSHOT/maven-metadata.xml
Progress (1): 823 B                   Uploaded to apache.snapshots.https: https://repository.apache.org/content/repositories/snapshots/org/apache/openjpa/openjpa-parent/3.0.1-SNAPSHOT/maven-metadata.xml (823 B at 713 B/s)
Uploading to apache.snapshots.https: https://repository.apache.org/content/repositories/snapshots/org/apache/openjpa/openjpa-parent/maven-metadata.xml
Progress (1): 634 B                   Uploaded to apache.snapshots.https: https://repository.apache.org/content/repositories/snapshots/org/apache/openjpa/openjpa-parent/maven-metadata.xml (634 B at 555 B/s)
Uploading to apache.snapshots.https: https://repository.apache.org/content/repositories/snapshots/org/apache/openjpa/openjpa-parent/3.0.1-SNAPSHOT/openjpa-parent-3.0.1-20190102.231801-26-site.xml
Progress (1): 1.6 kB                    Uploaded to apache.snapshots.https: https://repository.apache.org/content/repositories/snapshots/org/apache/openjpa/openjpa-parent/3.0.1-SNAPSHOT/openjpa-parent-3.0.1-20190102.231801-26-site.xml (1.6 kB at 1.4 kB/s)
Uploading to apache.snapshots.https: https://repository.apache.org/content/repositories/snapshots/org/apache/openjpa/openjpa-parent/3.0.1-SNAPSHOT/maven-metadata.xml
Progress (1): 823 B                   Uploaded to apache.snapshots.https: https://repository.apache.org/content/repositories/snapshots/org/apache/openjpa/openjpa-parent/3.0.1-SNAPSHOT/maven-metadata.xml (823 B at 724 B/s)
[INFO]
[INFO] -------------------< org.apache.openjpa:openjpa-lib >-------------------
[INFO] Building OpenJPA Utilities Library 3.0.1-SNAPSHOT                 [2/29]
[INFO] --------------------------------[ jar ]---------------------------------
Downloading from central: https://repo.maven.apache.org/maven2/org/slf4j/slf4j-api/1.7.23/slf4j-api-1.7.23.pom
Progress (1): 2.2/2.8 kBProgress (1): 2.8 kB                        Downloaded from central: https://repo.maven.apache.org/maven2/org/slf4j/slf4j-api/1.7.23/slf4j-api-1.7.23.pom (2.8 kB at 154 kB/s)
Downloading from central: https://repo.maven.apache.org/maven2/org/slf4j/slf4j-parent/1.7.23/slf4j-parent-1.7.23.pom
Progress (1): 2.2/14 kBProgress (1): 5.0/14 kBProgress (1): 7.8/14 kBProgress (1): 11/14 kB Progress (1): 13/14 kBProgress (1): 14 kB                      Downloaded from central: https://repo.maven.apache.org/maven2/org/slf4j/slf4j-parent/1.7.23/slf4j-parent-1.7.23.pom (14 kB at 794 kB/s)
Downloading from central: https://repo.maven.apache.org/maven2/org/apache/ant/ant/1.9.7/ant-1.9.7.pom
Progress (1): 2.2/9.6 kBProgress (1): 5.0/9.6 kBProgress (1): 7.8/9.6 kBProgress (1): 9.6 kB                        Downloaded from central: https://repo.maven.apache.org/maven2/org/apache/ant/ant/1.9.7/ant-1.9.7.pom (9.6 kB at 344 kB/s)
Downloading from central: https://repo.maven.apache.org/maven2/org/apache/ant/ant-parent/1.9.7/ant-parent-1.9.7.pom
Progress (1): 2.2/5.6 kBProgress (1): 5.0/5.6 kBProgress (1): 5.6 kB                        Downloaded from central: https://repo.maven.apache.org/maven2/org/apache/ant/ant-parent/1.9.7/ant-parent-1.9.7.pom (5.6 kB at 330 kB/s)
Downloading from central: https://repo.maven.apache.org/maven2/org/apache/ant/ant-launcher/1.9.7/ant-launcher-1.9.7.pom
Progress (1): 2.2/2.3 kBProgress (1): 2.3 kB                        Downloaded from central: https://repo.maven.apache.org/maven2/org/apache/ant/ant-launcher/1.9.7/ant-launcher-1.9.7.pom (2.3 kB at 130 kB/s)
[WARNING] The POM for org.apache.commons:commons-collections4:jar:4.3-SNAPSHOT is missing, no dependency information available
Downloading from central: https://repo.maven.apache.org/maven2/net/sourceforge/serp/serp/1.15.1/serp-1.15.1.pom
Progress (1): 2.2/5.3 kBProgress (1): 5.0/5.3 kBProgress (1): 5.3 kB                        Downloaded from central: https://repo.maven.apache.org/maven2/net/sourceforge/serp/serp/1.15.1/serp-1.15.1.pom (5.3 kB at 312 kB/s)
Downloading from central: https://repo.maven.apache.org/maven2/org/apache/geronimo/specs/geronimo-validation_1.1_spec/1.0/geronimo-validation_1.1_spec-1.0.pom
Progress (1): 2.2/5.1 kBProgress (1): 5.0/5.1 kBProgress (1): 5.1 kB                        Downloaded from central: https://repo.maven.apache.org/maven2/org/apache/geronimo/specs/geronimo-validation_1.1_spec/1.0/geronimo-validation_1.1_spec-1.0.pom (5.1 kB at 303 kB/s)
Downloading from central: https://repo.maven.apache.org/maven2/org/slf4j/slf4j-api/1.7.23/slf4j-api-1.7.23.jar
Downloading from central: https://repo.maven.apache.org/maven2/org/apache/ant/ant/1.9.7/ant-1.9.7.jar
Downloading from central: https://repo.maven.apache.org/maven2/org/apache/ant/ant-launcher/1.9.7/ant-launcher-1.9.7.jar
Downloading from central: https://repo.maven.apache.org/maven2/net/sourceforge/serp/serp/1.15.1/serp-1.15.1.jar
Downloading from central: https://repo.maven.apache.org/maven2/org/apache/geronimo/specs/geronimo-validation_1.1_spec/1.0/geronimo-validation_1.1_spec-1.0.jar
Progress (1): 2.2/18 kBProgress (1): 5.0/18 kBProgress (1): 7.7/18 kBProgress (1): 10/18 kB Progress (1): 13/18 kBProgress (1): 16/18 kBProgress (1): 18 kB   Progress (2): 18 kB | 0/2.0 MBProgress (2): 18 kB | 0/2.0 MBProgress (2): 18 kB | 0/2.0 MBProgress (2): 18 kB | 0/2.0 MB                              Downloaded from central: https://repo.maven.apache.org/maven2/org/apache/ant/ant-launcher/1.9.7/ant-launcher-1.9.7.jar (18 kB at 798 kB/s)
Progress (1): 0/2.0 MBProgress (2): 0/2.0 MB | 2.8/75 kBProgress (2): 0/2.0 MB | 2.8/75 kBProgress (3): 0/2.0 MB | 2.8/75 kB | 2.2/41 kBProgress (3): 0/2.0 MB | 2.8/75 kB | 2.2/41 kBProgress (3): 0/2.0 MB | 5.5/75 kB | 2.2/41 kBProgress (4): 0/2.0 MB | 5.5/75 kB | 2.2/41 kB | 2.2/217 kBProgress (4): 0/2.0 MB | 8.3/75 kB | 2.2/41 kB | 2.2/217 kBProgress (4): 0/2.0 MB | 8.3/75 kB | 5.0/41 kB | 2.2/217 kBProgress (4): 0/2.0 MB | 8.3/75 kB | 5.0/41 kB | 2.2/217 kBProgress (4): 0/2.0 MB | 8.3/75 kB | 7.7/41 kB | 2.2/217 kBProgress (4): 0/2.0 MB | 8.3/75 kB | 7.7/41 kB | 2.2/217 kBProgress (4): 0/2.0 MB | 11/75 kB | 7.7/41 kB | 2.2/217 kB Progress (4): 0/2.0 MB | 11/75 kB | 7.7/41 kB | 5.0/217 kBProgress (4): 0/2.0 MB | 11/75 kB | 7.7/41 kB | 5.0/217 kBProgress (4): 0/2.0 MB | 11/75 kB | 10/41 kB | 5.0/217 kB Progress (4): 0/2.0 MB | 11/75 kB | 10/41 kB | 7.7/217 kBProgress (4): 0/2.0 MB | 14/75 kB | 10/41 kB | 7.7/217 kBProgress (4): 0/2.0 MB | 14/75 kB | 10/41 kB | 10/217 kB Progress (4): 0/2.0 MB | 16/75 kB | 10/41 kB | 10/217 kBProgress (4): 0/2.0 MB | 16/75 kB | 13/41 kB | 10/217 kBProgress (4): 0/2.0 MB | 16/75 kB | 13/41 kB | 10/217 kBProgress (4): 0/2.0 MB | 16/75 kB | 16/41 kB | 10/217 kBProgress (4): 0/2.0 MB | 19/75 kB | 16/41 kB | 10/217 kBProgress (4): 0/2.0 MB | 19/75 kB | 16/41 kB | 13/217 kBProgress (4): 0/2.0 MB | 22/75 kB | 16/41 kB | 13/217 kBProgress (4): 0/2.0 MB | 22/75 kB | 19/41 kB | 13/217 kBProgress (4): 0/2.0 MB | 22/75 kB | 19/41 kB | 13/217 kBProgress (4): 0/2.0 MB | 22/75 kB | 21/41 kB | 13/217 kBProgress (4): 0/2.0 MB | 25/75 kB | 21/41 kB | 13/217 kBProgress (4): 0/2.0 MB | 25/75 kB | 21/41 kB | 16/217 kBProgress (4): 0/2.0 MB | 27/75 kB | 21/41 kB | 16/217 kBProgress (4): 0/2.0 MB | 27/75 kB | 21/41 kB | 19/217 kBProgress (4): 0/2.0 MB | 27/75 kB | 24/41 kB | 19/217 kBProgress (4): 0/2.0 MB | 27/75 kB | 24/41 kB | 21/217 kBProgress (4): 0/2.0 MB | 30/75 kB | 24/41 kB | 21/217 kBProgress (4): 0/2.0 MB | 30/75 kB | 24/41 kB | 21/217 kBProgress (4): 0/2.0 MB | 33/75 kB | 24/41 kB | 21/217 kBProgress (4): 0/2.0 MB | 33/75 kB | 24/41 kB | 24/217 kBProgress (4): 0/2.0 MB | 33/75 kB | 27/41 kB | 24/217 kBProgress (4): 0/2.0 MB | 33/75 kB | 27/41 kB | 27/217 kBProgress (4): 0/2.0 MB | 33/75 kB | 27/41 kB | 27/217 kBProgress (4): 0/2.0 MB | 33/75 kB | 27/41 kB | 30/217 kBProgress (4): 0/2.0 MB | 33/75 kB | 30/41 kB | 30/217 kBProgress (4): 0/2.0 MB | 33/75 kB | 32/41 kB | 30/217 kBProgress (4): 0/2.0 MB | 33/75 kB | 36/41 kB | 30/217 kBProgress (4): 0/2.0 MB | 33/75 kB | 40/41 kB | 30/217 kBProgress (4): 0/2.0 MB | 33/75 kB | 41 kB | 30/217 kB   Progress (4): 0/2.0 MB | 37/75 kB | 41 kB | 30/217 kBProgress (4): 0/2.0 MB | 37/75 kB | 41 kB | 32/217 kBProgress (4): 0/2.0 MB | 37/75 kB | 41 kB | 32/217 kBProgress (4): 0/2.0 MB | 37/75 kB | 41 kB | 32/217 kBProgress (4): 0/2.0 MB | 41/75 kB | 41 kB | 32/217 kBProgress (4): 0/2.0 MB | 45/75 kB | 41 kB | 32/217 kBProgress (4): 0/2.0 MB | 49/75 kB | 41 kB | 32/217 kBProgress (4): 0/2.0 MB | 49/75 kB | 41 kB | 36/217 kBProgress (4): 0.1/2.0 MB | 49/75 kB | 41 kB | 36/217 kBProgress (4): 0.1/2.0 MB | 49/75 kB | 41 kB | 40/217 kBProgress (4): 0.1/2.0 MB | 49/75 kB | 41 kB | 40/217 kBProgress (4): 0.1/2.0 MB | 49/75 kB | 41 kB | 45/217 kBProgress (4): 0.1/2.0 MB | 49/75 kB | 41 kB | 49/217 kBProgress (4): 0.1/2.0 MB | 53/75 kB | 41 kB | 49/217 kBProgress (4): 0.1/2.0 MB | 57/75 kB | 41 kB | 49/217 kBProgress (4): 0.1/2.0 MB | 61/75 kB | 41 kB | 49/217 kBProgress (4): 0.1/2.0 MB | 66/75 kB | 41 kB | 49/217 kBProgress (4): 0.1/2.0 MB | 66/75 kB | 41 kB | 53/217 kBProgress (4): 0.1/2.0 MB | 66/75 kB | 41 kB | 53/217 kBProgress (4): 0.1/2.0 MB | 66/75 kB | 41 kB | 57/217 kBProgress (4): 0.1/2.0 MB | 66/75 kB | 41 kB | 61/217 kBProgress (4): 0.1/2.0 MB | 66/75 kB | 41 kB | 65/217 kBProgress (4): 0.1/2.0 MB | 70/75 kB | 41 kB | 65/217 kB                                                       Downloaded from central: https://repo.maven.apache.org/maven2/org/slf4j/slf4j-api/1.7.23/slf4j-api-1.7.23.jar (41 kB at 790 kB/s)
Progress (3): 0.1/2.0 MB | 70/75 kB | 65/217 kBProgress (3): 0.1/2.0 MB | 70/75 kB | 69/217 kBProgress (3): 0.1/2.0 MB | 70/75 kB | 73/217 kBProgress (3): 0.1/2.0 MB | 74/75 kB | 73/217 kBProgress (3): 0.1/2.0 MB | 74/75 kB | 77/217 kBProgress (3): 0.1/2.0 MB | 74/75 kB | 77/217 kBProgress (3): 0.1/2.0 MB | 74/75 kB | 81/217 kBProgress (3): 0.1/2.0 MB | 75 kB | 81/217 kB   Progress (3): 0.1/2.0 MB | 75 kB | 81/217 kBProgress (3): 0.1/2.0 MB | 75 kB | 81/217 kBProgress (3): 0.1/2.0 MB | 75 kB | 81/217 kBProgress (3): 0.1/2.0 MB | 75 kB | 85/217 kBProgress (3): 0.1/2.0 MB | 75 kB | 90/217 kBProgress (3): 0.1/2.0 MB | 75 kB | 94/217 kBProgress (3): 0.1/2.0 MB | 75 kB | 94/217 kBProgress (3): 0.1/2.0 MB | 75 kB | 98/217 kBProgress (3): 0.1/2.0 MB | 75 kB | 98/217 kBProgress (3): 0.1/2.0 MB | 75 kB | 98/217 kBProgress (3): 0.1/2.0 MB | 75 kB | 98/217 kBProgress (3): 0.1/2.0 MB | 75 kB | 102/217 kBProgress (3): 0.1/2.0 MB | 75 kB | 106/217 kBProgress (3): 0.1/2.0 MB | 75 kB | 110/217 kBProgress (3): 0.1/2.0 MB | 75 kB | 114/217 kBProgress (3): 0.1/2.0 MB | 75 kB | 114/217 kBProgress (3): 0.1/2.0 MB | 75 kB | 114/217 kBProgress (3): 0.1/2.0 MB | 75 kB | 114/217 kBProgress (3): 0.1/2.0 MB | 75 kB | 114/217 kBProgress (3): 0.1/2.0 MB | 75 kB | 118/217 kBProgress (3): 0.1/2.0 MB | 75 kB | 122/217 kBProgress (3): 0.1/2.0 MB | 75 kB | 126/217 kBProgress (3): 0.1/2.0 MB | 75 kB | 131/217 kBProgress (3): 0.1/2.0 MB | 75 kB | 131/217 kBProgress (3): 0.1/2.0 MB | 75 kB | 131/217 kBProgress (3): 0.1/2.0 MB | 75 kB | 131/217 kBProgress (3): 0.1/2.0 MB | 75 kB | 135/217 kBProgress (3): 0.1/2.0 MB | 75 kB | 135/217 kBProgress (3): 0.1/2.0 MB | 75 kB | 139/217 kBProgress (3): 0.1/2.0 MB | 75 kB | 143/217 kBProgress (3): 0.1/2.0 MB | 75 kB | 147/217 kBProgress (3): 0.1/2.0 MB | 75 kB | 147/217 kBProgress (3): 0.1/2.0 MB | 75 kB | 147/217 kBProgress (3): 0.1/2.0 MB | 75 kB | 147/217 kBProgress (3): 0.1/2.0 MB | 75 kB | 147/217 kBProgress (3): 0.1/2.0 MB | 75 kB | 151/217 kB                                             Downloaded from central: https://repo.maven.apache.org/maven2/org/apache/geronimo/specs/geronimo-validation_1.1_spec/1.0/geronimo-validation_1.1_spec-1.0.jar (75 kB at 1.2 MB/s)
Progress (2): 0.1/2.0 MB | 155/217 kBProgress (2): 0.2/2.0 MB | 155/217 kBProgress (2): 0.2/2.0 MB | 159/217 kBProgress (2): 0.2/2.0 MB | 159/217 kBProgress (2): 0.2/2.0 MB | 163/217 kBProgress (2): 0.2/2.0 MB | 163/217 kBProgress (2): 0.2/2.0 MB | 163/217 kBProgress (2): 0.2/2.0 MB | 167/217 kBProgress (2): 0.2/2.0 MB | 171/217 kBProgress (2): 0.2/2.0 MB | 176/217 kBProgress (2): 0.2/2.0 MB | 176/217 kBProgress (2): 0.2/2.0 MB | 180/217 kBProgress (2): 0.2/2.0 MB | 180/217 kBProgress (2): 0.2/2.0 MB | 180/217 kBProgress (2): 0.2/2.0 MB | 180/217 kBProgress (2): 0.2/2.0 MB | 184/217 kBProgress (2): 0.2/2.0 MB | 188/217 kBProgress (2): 0.2/2.0 MB | 192/217 kBProgress (2): 0.2/2.0 MB | 196/217 kBProgress (2): 0.2/2.0 MB | 196/217 kBProgress (2): 0.2/2.0 MB | 196/217 kBProgress (2): 0.2/2.0 MB | 196/217 kBProgress (2): 0.2/2.0 MB | 196/217 kBProgress (2): 0.2/2.0 MB | 200/217 kBProgress (2): 0.2/2.0 MB | 204/217 kBProgress (2): 0.2/2.0 MB | 208/217 kBProgress (2): 0.2/2.0 MB | 212/217 kBProgress (2): 0.2/2.0 MB | 212/217 kBProgress (2): 0.2/2.0 MB | 217/217 kBProgress (2): 0.2/2.0 MB | 217/217 kBProgress (2): 0.2/2.0 MB | 217 kB    Progress (2): 0.2/2.0 MB | 217 kBProgress (2): 0.2/2.0 MB | 217 kBProgress (2): 0.2/2.0 MB | 217 kBProgress (2): 0.2/2.0 MB | 217 kBProgress (2): 0.2/2.0 MB | 217 kBProgress (2): 0.2/2.0 MB | 217 kBProgress (2): 0.2/2.0 MB | 217 kBProgress (2): 0.2/2.0 MB | 217 kBProgress (2): 0.2/2.0 MB | 217 kBProgress (2): 0.2/2.0 MB | 217 kBProgress (2): 0.2/2.0 MB | 217 kBProgress (2): 0.3/2.0 MB | 217 kBProgress (2): 0.3/2.0 MB | 217 kBProgress (2): 0.3/2.0 MB | 217 kBProgress (2): 0.3/2.0 MB | 217 kBProgress (2): 0.3/2.0 MB | 217 kBProgress (2): 0.3/2.0 MB | 217 kB                                 Downloaded from central: https://repo.maven.apache.org/maven2/net/sourceforge/serp/serp/1.15.1/serp-1.15.1.jar (217 kB at 2.9 MB/s)
Progress (1): 0.3/2.0 MBProgress (1): 0.3/2.0 MBProgress (1): 0.3/2.0 MBProgress (1): 0.3/2.0 MBProgress (1): 0.3/2.0 MBProgress (1): 0.3/2.0 MBProgress (1): 0.3/2.0 MBProgress (1): 0.3/2.0 MBProgress (1): 0.3/2.0 MBProgress (1): 0.3/2.0 MBProgress (1): 0.3/2.0 MBProgress (1): 0.3/2.0 MBProgress (1): 0.3/2.0 MBProgress (1): 0.3/2.0 MBProgress (1): 0.3/2.0 MBProgress (1): 0.3/2.0 MBProgress (1): 0.3/2.0 MBProgress (1): 0.3/2.0 MBProgress (1): 0.4/2.0 MBProgress (1): 0.4/2.0 MBProgress (1): 0.4/2.0 MBProgress (1): 0.4/2.0 MBProgress (1): 0.4/2.0 MBProgress (1): 0.4/2.0 MBProgress (1): 0.4/2.0 MBProgress (1): 0.4/2.0 MBProgress (1): 0.4/2.0 MBProgress (1): 0.4/2.0 MBProgress (1): 0.4/2.0 MBProgress (1): 0.4/2.0 MBProgress (1): 0.4/2.0 MBProgress (1): 0.4/2.0 MBProgress (1): 0.4/2.0 MBProgress (1): 0.4/2.0 MBProgress (1): 0.4/2.0 MBProgress (1): 0.4/2.0 MBProgress (1): 0.4/2.0 MBProgress (1): 0.4/2.0 MBProgress (1): 0.4/2.0 MBProgress (1): 0.4/2.0 MBProgress (1): 0.4/2.0 MBProgress (1): 0.4/2.0 MBProgress (1): 0.5/2.0 MBProgress (1): 0.5/2.0 MBProgress (1): 0.5/2.0 MBProgress (1): 0.5/2.0 MBProgress (1): 0.5/2.0 MBProgress (1): 0.5/2.0 MBProgress (1): 0.5/2.0 MBProgress (1): 0.5/2.0 MBProgress (1): 0.5/2.0 MBProgress (1): 0.5/2.0 MBProgress (1): 0.5/2.0 MBProgress (1): 0.5/2.0 MBProgress (1): 0.5/2.0 MBProgress (1): 0.5/2.0 MBProgress (1): 0.5/2.0 MBProgress (1): 0.5/2.0 MBProgress (1): 0.5/2.0 MBProgress (1): 0.5/2.0 MBProgress (1): 0.5/2.0 MBProgress (1): 0.5/2.0 MBProgress (1): 0.5/2.0 MBProgress (1): 0.5/2.0 MBProgress (1): 0.5/2.0 MBProgress (1): 0.5/2.0 MBProgress (1): 0.5/2.0 MBProgress (1): 0.6/2.0 MBProgress (1): 0.6/2.0 MBProgress (1): 0.6/2.0 MBProgress (1): 0.6/2.0 MBProgress (1): 0.6/2.0 MBProgress (1): 0.6/2.0 MBProgress (1): 0.6/2.0 MBProgress (1): 0.6/2.0 MBProgress (1): 0.6/2.0 MBProgress (1): 0.6/2.0 MBProgress (1): 0.6/2.0 MBProgress (1): 0.6/2.0 MBProgress (1): 0.6/2.0 MBProgress (1): 0.6/2.0 MBProgress (1): 0.6/2.0 MBProgress (1): 0.6/2.0 MBProgress (1): 0.6/2.0 MBProgress (1): 0.6/2.0 MBProgress (1): 0.6/2.0 MBProgress (1): 0.6/2.0 MBProgress (1): 0.6/2.0 MBProgress (1): 0.6/2.0 MBProgress (1): 0.6/2.0 MBProgress (1): 0.6/2.0 MBProgress (1): 0.7/2.0 MBProgress (1): 0.7/2.0 MBProgress (1): 0.7/2.0 MBProgress (1): 0.7/2.0 MBProgress (1): 0.7/2.0 MBProgress (1): 0.7/2.0 MBProgress (1): 0.7/2.0 MBProgress (1): 0.7/2.0 MBProgress (1): 0.7/2.0 MBProgress (1): 0.7/2.0 MBProgress (1): 0.7/2.0 MBProgress (1): 0.7/2.0 MBProgress (1): 0.7/2.0 MBProgress (1): 0.7/2.0 MBProgress (1): 0.7/2.0 MBProgress (1): 0.7/2.0 MBProgress (1): 0.7/2.0 MBProgress (1): 0.7/2.0 MBProgress (1): 0.7/2.0 MBProgress (1): 0.7/2.0 MBProgress (1): 0.7/2.0 MBProgress (1): 0.7/2.0 MBProgress (1): 0.7/2.0 MBProgress (1): 0.7/2.0 MBProgress (1): 0.7/2.0 MBProgress (1): 0.8/2.0 MBProgress (1): 0.8/2.0 MBProgress (1): 0.8/2.0 MBProgress (1): 0.8/2.0 MBProgress (1): 0.8/2.0 MBProgress (1): 0.8/2.0 MBProgress (1): 0.8/2.0 MBProgress (1): 0.8/2.0 MBProgress (1): 0.8/2.0 MBProgress (1): 0.8/2.0 MBProgress (1): 0.8/2.0 MBProgress (1): 0.8/2.0 MBProgress (1): 0.8/2.0 MBProgress (1): 0.8/2.0 MBProgress (1): 0.8/2.0 MBProgress (1): 0.8/2.0 MBProgress (1): 0.8/2.0 MBProgress (1): 0.8/2.0 MBProgress (1): 0.8/2.0 MBProgress (1): 0.8/2.0 MBProgress (1): 0.8/2.0 MBProgress (1): 0.8/2.0 MBProgress (1): 0.8/2.0 MBProgress (1): 0.8/2.0 MBProgress (1): 0.9/2.0 MBProgress (1): 0.9/2.0 MBProgress (1): 0.9/2.0 MBProgress (1): 0.9/2.0 MBProgress (1): 0.9/2.0 MBProgress (1): 0.9/2.0 MBProgress (1): 0.9/2.0 MBProgress (1): 0.9/2.0 MBProgress (1): 0.9/2.0 MBProgress (1): 0.9/2.0 MBProgress (1): 0.9/2.0 MBProgress (1): 0.9/2.0 MBProgress (1): 0.9/2.0 MBProgress (1): 0.9/2.0 MBProgress (1): 0.9/2.0 MBProgress (1): 0.9/2.0 MBProgress (1): 0.9/2.0 MBProgress (1): 0.9/2.0 MBProgress (1): 0.9/2.0 MBProgress (1): 0.9/2.0 MBProgress (1): 0.9/2.0 MBProgress (1): 0.9/2.0 MBProgress (1): 0.9/2.0 MBProgress (1): 0.9/2.0 MBProgress (1): 0.9/2.0 MBProgress (1): 1.0/2.0 MBProgress (1): 1.0/2.0 MBProgress (1): 1.0/2.0 MBProgress (1): 1.0/2.0 MBProgress (1): 1.0/2.0 MBProgress (1): 1.0/2.0 MBProgress (1): 1.0/2.0 MBProgress (1): 1.0/2.0 MBProgress (1): 1.0/2.0 MBProgress (1): 1.0/2.0 MBProgress (1): 1.0/2.0 MBProgress (1): 1.0/2.0 MBProgress (1): 1.0/2.0 MBProgress (1): 1.0/2.0 MBProgress (1): 1.0/2.0 MBProgress (1): 1.0/2.0 MBProgress (1): 1.0/2.0 MBProgress (1): 1.0/2.0 MBProgress (1): 1.0/2.0 MBProgress (1): 1.0/2.0 MBProgress (1): 1.0/2.0 MBProgress (1): 1.0/2.0 MBProgress (1): 1.0/2.0 MBProgress (1): 1.0/2.0 MBProgress (1): 1.1/2.0 MBProgress (1): 1.1/2.0 MBProgress (1): 1.1/2.0 MBProgress (1): 1.1/2.0 MBProgress (1): 1.1/2.0 MBProgress (1): 1.1/2.0 MBProgress (1): 1.1/2.0 MBProgress (1): 1.1/2.0 MBProgress (1): 1.1/2.0 MBProgress (1): 1.1/2.0 MBProgress (1): 1.1/2.0 MBProgress (1): 1.1/2.0 MBProgress (1): 1.1/2.0 MBProgress (1): 1.1/2.0 MBProgress (1): 1.1/2.0 MBProgress (1): 1.1/2.0 MBProgress (1): 1.1/2.0 MBProgress (1): 1.1/2.0 MBProgress (1): 1.1/2.0 MBProgress (1): 1.1/2.0 MBProgress (1): 1.1/2.0 MBProgress (1): 1.1/2.0 MBProgress (1): 1.1/2.0 MBProgress (1): 1.1/2.0 MBProgress (1): 1.2/2.0 MBProgress (1): 1.2/2.0 MBProgress (1): 1.2/2.0 MBProgress (1): 1.2/2.0 MBProgress (1): 1.2/2.0 MBProgress (1): 1.2/2.0 MBProgress (1): 1.2/2.0 MBProgress (1): 1.2/2.0 MBProgress (1): 1.2/2.0 MBProgress (1): 1.2/2.0 MBProgress (1): 1.2/2.0 MBProgress (1): 1.2/2.0 MBProgress (1): 1.2/2.0 MBProgress (1): 1.2/2.0 MBProgress (1): 1.2/2.0 MBProgress (1): 1.2/2.0 MBProgress (1): 1.2/2.0 MBProgress (1): 1.2/2.0 MBProgress (1): 1.2/2.0 MBProgress (1): 1.2/2.0 MBProgress (1): 1.2/2.0 MBProgress (1): 1.2/2.0 MBProgress (1): 1.2/2.0 MBProgress (1): 1.2/2.0 MBProgress (1): 1.2/2.0 MBProgress (1): 1.3/2.0 MBProgress (1): 1.3/2.0 MBProgress (1): 1.3/2.0 MBProgress (1): 1.3/2.0 MBProgress (1): 1.3/2.0 MBProgress (1): 1.3/2.0 MBProgress (1): 1.3/2.0 MBProgress (1): 1.3/2.0 MBProgress (1): 1.3/2.0 MBProgress (1): 1.3/2.0 MBProgress (1): 1.3/2.0 MBProgress (1): 1.3/2.0 MBProgress (1): 1.3/2.0 MBProgress (1): 1.3/2.0 MBProgress (1): 1.3/2.0 MBProgress (1): 1.3/2.0 MBProgress (1): 1.3/2.0 MBProgress (1): 1.3/2.0 MBProgress (1): 1.3/2.0 MBProgress (1): 1.3/2.0 MBProgress (1): 1.3/2.0 MBProgress (1): 1.3/2.0 MBProgress (1): 1.3/2.0 MBProgress (1): 1.3/2.0 MBProgress (1): 1.4/2.0 MBProgress (1): 1.4/2.0 MBProgress (1): 1.4/2.0 MBProgress (1): 1.4/2.0 MBProgress (1): 1.4/2.0 MBProgress (1): 1.4/2.0 MBProgress (1): 1.4/2.0 MBProgress (1): 1.4/2.0 MBProgress (1): 1.4/2.0 MBProgress (1): 1.4/2.0 MBProgress (1): 1.4/2.0 MBProgress (1): 1.4/2.0 MBProgress (1): 1.4/2.0 MBProgress (1): 1.4/2.0 MBProgress (1): 1.4/2.0 MBProgress (1): 1.4/2.0 MBProgress (1): 1.4/2.0 MBProgress (1): 1.4/2.0 MBProgress (1): 1.4/2.0 MBProgress (1): 1.4/2.0 MBProgress (1): 1.4/2.0 MBProgress (1): 1.4/2.0 MBProgress (1): 1.4/2.0 MBProgress (1): 1.4/2.0 MBProgress (1): 1.4/2.0 MBProgress (1): 1.5/2.0 MBProgress (1): 1.5/2.0 MBProgress (1): 1.5/2.0 MBProgress (1): 1.5/2.0 MBProgress (1): 1.5/2.0 MBProgress (1): 1.5/2.0 MBProgress (1): 1.5/2.0 MBProgress (1): 1.5/2.0 MBProgress (1): 1.5/2.0 MBProgress (1): 1.5/2.0 MBProgress (1): 1.5/2.0 MBProgress (1): 1.5/2.0 MBProgress (1): 1.5/2.0 MBProgress (1): 1.5/2.0 MBProgress (1): 1.5/2.0 MBProgress (1): 1.5/2.0 MBProgress (1): 1.5/2.0 MBProgress (1): 1.5/2.0 MBProgress (1): 1.5/2.0 MBProgress (1): 1.5/2.0 MBProgress (1): 1.5/2.0 MBProgress (1): 1.5/2.0 MBProgress (1): 1.5/2.0 MBProgress (1): 1.5/2.0 MBProgress (1): 1.6/2.0 MBProgress (1): 1.6/2.0 MBProgress (1): 1.6/2.0 MBProgress (1): 1.6/2.0 MBProgress (1): 1.6/2.0 MBProgress (1): 1.6/2.0 MBProgress (1): 1.6/2.0 MBProgress (1): 1.6/2.0 MBProgress (1): 1.6/2.0 MBProgress (1): 1.6/2.0 MBProgress (1): 1.6/2.0 MBProgress (1): 1.6/2.0 MBProgress (1): 1.6/2.0 MBProgress (1): 1.6/2.0 MBProgress (1): 1.6/2.0 MBProgress (1): 1.6/2.0 MBProgress (1): 1.6/2.0 MBProgress (1): 1.6/2.0 MBProgress (1): 1.6/2.0 MBProgress (1): 1.6/2.0 MBProgress (1): 1.6/2.0 MBProgress (1): 1.6/2.0 MBProgress (1): 1.6/2.0 MBProgress (1): 1.6/2.0 MBProgress (1): 1.7/2.0 MBProgress (1): 1.7/2.0 MBProgress (1): 1.7/2.0 MBProgress (1): 1.7/2.0 MBProgress (1): 1.7/2.0 MBProgress (1): 1.7/2.0 MBProgress (1): 1.7/2.0 MBProgress (1): 1.7/2.0 MBProgress (1): 1.7/2.0 MBProgress (1): 1.7/2.0 MBProgress (1): 1.7/2.0 MBProgress (1): 1.7/2.0 MBProgress (1): 1.7/2.0 MBProgress (1): 1.7/2.0 MBProgress (1): 1.7/2.0 MBProgress (1): 1.7/2.0 MBProgress (1): 1.7/2.0 MBProgress (1): 1.7/2.0 MBProgress (1): 1.7/2.0 MBProgress (1): 1.7/2.0 MBProgress (1): 1.7/2.0 MBProgress (1): 1.7/2.0 MBProgress (1): 1.7/2.0 MBProgress (1): 1.7/2.0 MBProgress (1): 1.7/2.0 MBProgress (1): 1.8/2.0 MBProgress (1): 1.8/2.0 MBProgress (1): 1.8/2.0 MBProgress (1): 1.8/2.0 MBProgress (1): 1.8/2.0 MBProgress (1): 1.8/2.0 MBProgress (1): 1.8/2.0 MBProgress (1): 1.8/2.0 MBProgress (1): 1.8/2.0 MBProgress (1): 1.8/2.0 MBProgress (1): 1.8/2.0 MBProgress (1): 1.8/2.0 MBProgress (1): 1.8/2.0 MBProgress (1): 1.8/2.0 MBProgress (1): 1.8/2.0 MBProgress (1): 1.8/2.0 MBProgress (1): 1.8/2.0 MBProgress (1): 1.8/2.0 MBProgress (1): 1.8/2.0 MBProgress (1): 1.8/2.0 MBProgress (1): 1.8/2.0 MBProgress (1): 1.8/2.0 MBProgress (1): 1.8/2.0 MBProgress (1): 1.8/2.0 MBProgress (1): 1.9/2.0 MBProgress (1): 1.9/2.0 MBProgress (1): 1.9/2.0 MBProgress (1): 1.9/2.0 MBProgress (1): 1.9/2.0 MBProgress (1): 1.9/2.0 MBProgress (1): 1.9/2.0 MBProgress (1): 1.9/2.0 MBProgress (1): 1.9/2.0 MBProgress (1): 1.9/2.0 MBProgress (1): 1.9/2.0 MBProgress (1): 1.9/2.0 MBProgress (1): 1.9/2.0 MBProgress (1): 1.9/2.0 MBProgress (1): 1.9/2.0 MBProgress (1): 1.9/2.0 MBProgress (1): 1.9/2.0 MBProgress (1): 1.9/2.0 MBProgress (1): 1.9/2.0 MBProgress (1): 1.9/2.0 MBProgress (1): 1.9/2.0 MBProgress (1): 1.9/2.0 MBProgress (1): 1.9/2.0 MBProgress (1): 1.9/2.0 MBProgress (1): 1.9/2.0 MBProgress (1): 2.0/2.0 MBProgress (1): 2.0/2.0 MBProgress (1): 2.0/2.0 MBProgress (1): 2.0/2.0 MBProgress (1): 2.0/2.0 MBProgress (1): 2.0/2.0 MBProgress (1): 2.0/2.0 MBProgress (1): 2.0/2.0 MBProgress (1): 2.0/2.0 MBProgress (1): 2.0/2.0 MBProgress (1): 2.0/2.0 MBProgress (1): 2.0/2.0 MBProgress (1): 2.0/2.0 MBProgress (1): 2.0/2.0 MBProgress (1): 2.0/2.0 MBProgress (1): 2.0/2.0 MBProgress (1): 2.0/2.0 MBProgress (1): 2.0/2.0 MBProgress (1): 2.0/2.0 MBProgress (1): 2.0/2.0 MBProgress (1): 2.0/2.0 MBProgress (1): 2.0 MB                        Downloaded from central: https://repo.maven.apache.org/maven2/org/apache/ant/ant/1.9.7/ant-1.9.7.jar (2.0 MB at 9.0 MB/s)
[INFO] ------------------------------------------------------------------------
[INFO] Reactor Summary:
[INFO]
[INFO] OpenJPA Parent POM 3.0.1-SNAPSHOT .................. SUCCESS [ 12.972 s]
[INFO] OpenJPA Utilities Library .......................... FAILURE [  0.450 s]
[INFO] OpenJPA Kernel ..................................... SKIPPED
[INFO] OpenJPA JDBC ....................................... SKIPPED
[INFO] OpenJPA Persistence ................................ SKIPPED
[INFO] OpenJPA Persistence JDBC ........................... SKIPPED
[INFO] OpenJPA Persistence Locking Tests .................. SKIPPED
[INFO] OpenJPA tools ...................................... SKIPPED
[INFO] OpenJPA Maven Plugin ............................... SKIPPED
[INFO] OpenJPA XML Store .................................. SKIPPED
[INFO] OpenJPA Slice ...................................... SKIPPED
[INFO] OpenJPA JEST ....................................... SKIPPED
[INFO] OpenJPA Aggregate Jar .............................. SKIPPED
[INFO] OpenJPA Aggregate Jar with Dependencies ............ SKIPPED
[INFO] OpenJPA Project Docs and Assemblies ................ SKIPPED
[INFO] OpenJPA Examples ................................... SKIPPED
[INFO] OpenJPA Examples - Simple .......................... SKIPPED
[INFO] OpenJPA Examples - image-gallery ................... SKIPPED
[INFO] OpenJPA Examples - OpenBooks ....................... SKIPPED
[INFO] OpenJPA Integration Tests .......................... SKIPPED
[INFO] OpenJPA Integration Tests - Daytrader .............. SKIPPED
[INFO] OpenJPA Integration Tests - Examples ............... SKIPPED
[INFO] OpenJPA Integration Tests - SLF4JLogFactory ........ SKIPPED
[INFO] OpenJPA Integration Tests - JPA TCK ................ SKIPPED
[INFO] OpenJPA Integration Tests - Bean Validation ........ SKIPPED
[INFO] OpenJPA Integration Tests - JMX Platform MBeans .... SKIPPED
[INFO] OpenJPA Fetching Statistic Tool .................... SKIPPED
[INFO] OpenJPA Fetching Statistic Tool -- WAS Bundle ...... SKIPPED
[INFO] OpenJPA Features 3.0.1-SNAPSHOT .................... SKIPPED
[INFO] ------------------------------------------------------------------------
[INFO] BUILD FAILURE
[INFO] ------------------------------------------------------------------------
[INFO] Total time: 14.858 s
[INFO] Finished at: 2019-01-02T23:18:08Z
[INFO] ------------------------------------------------------------------------
[ERROR] Failed to execute goal on project openjpa-lib: Could not resolve dependencies for project org.apache.openjpa:openjpa-lib:jar:3.0.1-SNAPSHOT: Could not find artifact org.apache.commons:commons-collections4:jar:4.3-SNAPSHOT -> [Help 1]
[ERROR]
[ERROR] To see the full stack trace of the errors, re-run Maven with the -e switch.
[ERROR] Re-run Maven using the -X switch to enable full debug logging.
[ERROR]
[ERROR] For more information about the errors and possible solutions, please read the following articles:
[ERROR] [Help 1] http://cwiki.apache.org/confluence/display/MAVEN/DependencyResolutionException
[ERROR]
[ERROR] After correcting the problems, you can resume the build with the command
[ERROR]   mvn <goals> -rf :openjpa-lib
Build step 'Execute shell' marked build as failure
Archiving artifacts
Setting ANT_1_9_7_HOME=/home/jenkins/tools/ant/apache-ant-1.9.7
Setting MAVEN_3_0_4_HOME=/home/jenkins/tools/maven/apache-maven-3.0.4
Setting JDK_1_8_LATEST__HOME=/home/jenkins/tools/java/latest1.8
Setting MAVEN_3_5_4_HOME=/home/jenkins/tools/maven/apache-maven-3.5.4
Setting ANT_1_9_7_HOME=/home/jenkins/tools/ant/apache-ant-1.9.7
Setting MAVEN_3_0_4_HOME=/home/jenkins/tools/maven/apache-maven-3.0.4
Setting JDK_1_8_LATEST__HOME=/home/jenkins/tools/java/latest1.8
Setting MAVEN_3_5_4_HOME=/home/jenkins/tools/maven/apache-maven-3.5.4
Reply | Threaded
Open this post in threaded view
|

Jenkins build is back to normal : OpenJPA-Trunk-Deploy #41

Apache Jenkins Server-2