Build failed in Jenkins: OpenJPA-Trunk-new #1

classic Classic list List threaded Threaded
7 messages Options
Reply | Threaded
Open this post in threaded view
|  
Report Content as Inappropriate

Build failed in Jenkins: OpenJPA-Trunk-new #1

Apache Jenkins Server-2
See <https://builds.apache.org/job/OpenJPA-Trunk-new/1/display/redirect>

------------------------------------------
[...truncated 1.99 MB...]
[INFO] Exclude: **/target/**/*
[INFO] 1 resources included (use -debug for more details)
[INFO] Rat check: Summary of files. Unapproved: 0 unknown: 0 generated: 0 approved: 0 licence.
[INFO]
[INFO] --- maven-install-plugin:2.5.2:install (default-install) @ openjpa-fetch-statistics-was ---
[INFO] Installing <https://builds.apache.org/job/OpenJPA-Trunk-new/ws/openjpa-tools/openjpa-fetch-statistics-was/target/openjpa-fetch-statistics-was-3.0.0-SNAPSHOT.jar> to /home/jenkins/.m2/repository/org/apache/openjpa/openjpa-fetch-statistics-was/3.0.0-SNAPSHOT/openjpa-fetch-statistics-was-3.0.0-SNAPSHOT.jar
[INFO] Installing <https://builds.apache.org/job/OpenJPA-Trunk-new/ws/openjpa-tools/openjpa-fetch-statistics-was/dependency-reduced-pom.xml> to /home/jenkins/.m2/repository/org/apache/openjpa/openjpa-fetch-statistics-was/3.0.0-SNAPSHOT/openjpa-fetch-statistics-was-3.0.0-SNAPSHOT.pom
[INFO] Installing <https://builds.apache.org/job/OpenJPA-Trunk-new/ws/openjpa-tools/openjpa-fetch-statistics-was/target/openjpa-fetch-statistics-was-3.0.0-SNAPSHOT-tests.jar> to /home/jenkins/.m2/repository/org/apache/openjpa/openjpa-fetch-statistics-was/3.0.0-SNAPSHOT/openjpa-fetch-statistics-was-3.0.0-SNAPSHOT-tests.jar
[INFO]                                                                        
[INFO] ------------------------------------------------------------------------
[INFO] Building OpenJPA Features 3.0.0-SNAPSHOT
[INFO] ------------------------------------------------------------------------
Downloading: http://repo.maven.apache.org/maven2/org/apache/karaf/tooling/karaf-maven-plugin/maven-metadata.xml
2/2 KB              Downloaded: http://repo.maven.apache.org/maven2/org/apache/karaf/tooling/karaf-maven-plugin/maven-metadata.xml (2 KB at 67.5 KB/sec)
Downloading: http://repo.maven.apache.org/maven2/org/codehaus/mojo/build-helper-maven-plugin/maven-metadata.xml
760/760 B               Downloaded: http://repo.maven.apache.org/maven2/org/codehaus/mojo/build-helper-maven-plugin/maven-metadata.xml (760 B at 46.4 KB/sec)
[INFO]
[INFO] --- maven-clean-plugin:3.0.0:clean (default-clean) @ openjpa-features ---
[INFO]
[INFO] --- buildnumber-maven-plugin:1.4:create (default) @ openjpa-features ---
[INFO]
[INFO] --- maven-enforcer-plugin:1.4.1:enforce (default) @ openjpa-features ---
[INFO]
[INFO] --- maven-checkstyle-plugin:2.9:checkstyle (default) @ openjpa-features ---
[INFO]
[INFO] --- maven-remote-resources-plugin:1.5:process (process-resource-bundles) @ openjpa-features ---
[INFO]
[INFO] --- karaf-maven-plugin:4.1.1:features-generate-descriptor (compile) @ openjpa-features ---
Jul 20, 2017 10:01:58 PM org.sonatype.guice.bean.reflect.Logs$JULSink warn
WARNING: Error injecting: org.apache.karaf.tooling.features.GenerateDescriptorMojo
java.lang.TypeNotPresentException: Type org.apache.karaf.tooling.features.GenerateDescriptorMojo not present
        at org.sonatype.guice.bean.reflect.URLClassSpace.loadClass(URLClassSpace.java:109)
        at org.sonatype.guice.bean.reflect.NamedClass.load(NamedClass.java:45)
        at org.sonatype.guice.bean.reflect.AbstractDeferredClass.get(AbstractDeferredClass.java:45)
        at com.google.inject.internal.ProviderInternalFactory.provision(ProviderInternalFactory.java:84)
        at com.google.inject.internal.InternalFactoryToInitializableAdapter.provision(InternalFactoryToInitializableAdapter.java:52)
        at com.google.inject.internal.ProviderInternalFactory$1.call(ProviderInternalFactory.java:70)
        at com.google.inject.internal.ProvisionListenerStackCallback$Provision.provision(ProvisionListenerStackCallback.java:100)
        at org.sonatype.guice.plexus.lifecycles.PlexusLifecycleManager.onProvision(PlexusLifecycleManager.java:138)
        at com.google.inject.internal.ProvisionListenerStackCallback$Provision.provision(ProvisionListenerStackCallback.java:108)
        at com.google.inject.internal.ProvisionListenerStackCallback.provision(ProvisionListenerStackCallback.java:55)
        at com.google.inject.internal.ProviderInternalFactory.circularGet(ProviderInternalFactory.java:68)
        at com.google.inject.internal.InternalFactoryToInitializableAdapter.get(InternalFactoryToInitializableAdapter.java:45)
        at com.google.inject.internal.InjectorImpl$3$1.call(InjectorImpl.java:965)
        at com.google.inject.internal.InjectorImpl.callInContext(InjectorImpl.java:1011)
        at com.google.inject.internal.InjectorImpl$3.get(InjectorImpl.java:961)
        at com.google.inject.Scopes$1$1.get(Scopes.java:59)
        at org.sonatype.guice.bean.locators.LazyBeanEntry.getValue(LazyBeanEntry.java:83)
        at org.sonatype.guice.plexus.locators.LazyPlexusBean.getValue(LazyPlexusBean.java:49)
        at org.codehaus.plexus.DefaultPlexusContainer.lookup(DefaultPlexusContainer.java:253)
        at org.codehaus.plexus.DefaultPlexusContainer.lookup(DefaultPlexusContainer.java:245)
        at org.apache.maven.plugin.internal.DefaultMavenPluginManager.getConfiguredMojo(DefaultMavenPluginManager.java:455)
        at org.apache.maven.plugin.DefaultBuildPluginManager.executeMojo(DefaultBuildPluginManager.java:92)
        at org.apache.maven.lifecycle.internal.MojoExecutor.execute(MojoExecutor.java:209)
        at org.apache.maven.lifecycle.internal.MojoExecutor.execute(MojoExecutor.java:153)
        at org.apache.maven.lifecycle.internal.MojoExecutor.execute(MojoExecutor.java:145)
        at org.apache.maven.lifecycle.internal.LifecycleModuleBuilder.buildProject(LifecycleModuleBuilder.java:84)
        at org.apache.maven.lifecycle.internal.LifecycleModuleBuilder.buildProject(LifecycleModuleBuilder.java:59)
        at org.apache.maven.lifecycle.internal.LifecycleStarter.singleThreadedBuild(LifecycleStarter.java:183)
        at org.apache.maven.lifecycle.internal.LifecycleStarter.execute(LifecycleStarter.java:161)
        at org.apache.maven.DefaultMaven.doExecute(DefaultMaven.java:320)
        at org.apache.maven.DefaultMaven.execute(DefaultMaven.java:156)
        at org.apache.maven.cli.MavenCli.execute(MavenCli.java:537)
        at org.apache.maven.cli.MavenCli.doMain(MavenCli.java:196)
        at org.apache.maven.cli.MavenCli.main(MavenCli.java:141)
        at sun.reflect.NativeMethodAccessorImpl.invoke0(Native Method)
        at sun.reflect.NativeMethodAccessorImpl.invoke(NativeMethodAccessorImpl.java:57)
        at sun.reflect.DelegatingMethodAccessorImpl.invoke(DelegatingMethodAccessorImpl.java:43)
        at java.lang.reflect.Method.invoke(Method.java:606)
        at org.codehaus.plexus.classworlds.launcher.Launcher.launchEnhanced(Launcher.java:290)
        at org.codehaus.plexus.classworlds.launcher.Launcher.launch(Launcher.java:230)
        at org.codehaus.plexus.classworlds.launcher.Launcher.mainWithExitCode(Launcher.java:409)
        at org.codehaus.plexus.classworlds.launcher.Launcher.main(Launcher.java:352)
Caused by: java.lang.UnsupportedClassVersionError: org/apache/karaf/tooling/features/GenerateDescriptorMojo : Unsupported major.minor version 52.0
        at java.lang.ClassLoader.defineClass1(Native Method)
        at java.lang.ClassLoader.defineClass(ClassLoader.java:800)
        at java.security.SecureClassLoader.defineClass(SecureClassLoader.java:142)
        at java.net.URLClassLoader.defineClass(URLClassLoader.java:449)
        at java.net.URLClassLoader.access$100(URLClassLoader.java:71)
        at java.net.URLClassLoader$1.run(URLClassLoader.java:361)
        at java.net.URLClassLoader$1.run(URLClassLoader.java:355)
        at java.security.AccessController.doPrivileged(Native Method)
        at java.net.URLClassLoader.findClass(URLClassLoader.java:354)
        at org.codehaus.plexus.classworlds.realm.ClassRealm.loadClassFromSelf(ClassRealm.java:386)
        at org.codehaus.plexus.classworlds.strategy.SelfFirstStrategy.loadClass(SelfFirstStrategy.java:42)
        at org.codehaus.plexus.classworlds.realm.ClassRealm.loadClass(ClassRealm.java:244)
        at org.codehaus.plexus.classworlds.realm.ClassRealm.loadClass(ClassRealm.java:230)
        at org.sonatype.guice.bean.reflect.URLClassSpace.loadClass(URLClassSpace.java:101)
        ... 41 more

[INFO] ------------------------------------------------------------------------
[INFO] Reactor Summary:
[INFO]
[INFO] OpenJPA Parent POM ................................ SUCCESS [8.099s]
[INFO] OpenJPA Utilities Library ......................... SUCCESS [14.262s]
[INFO] OpenJPA Kernel .................................... SUCCESS [10.634s]
[INFO] OpenJPA JDBC ...................................... SUCCESS [6.937s]
[INFO] OpenJPA Persistence ............................... SUCCESS [4.401s]
[INFO] OpenJPA Persistence JDBC .......................... SUCCESS [13:23.467s]
[INFO] OpenJPA Persistence Locking Tests ................. SUCCESS [23:55.383s]
[INFO] OpenJPA tools ..................................... SUCCESS [0.094s]
[INFO] OpenJPA Maven Plugin .............................. SUCCESS [1:15.901s]
[INFO] OpenJPA XML Store ................................. SUCCESS [8.488s]
[INFO] OpenJPA Slice ..................................... SUCCESS [1.489s]
[INFO] OpenJPA JEST ...................................... SUCCESS [5.874s]
[INFO] OpenJPA Aggregate Jar ............................. SUCCESS [6.442s]
[INFO] OpenJPA Aggregate Jar with Dependencies ........... SUCCESS [1.863s]
[INFO] OpenJPA Project Docs and Assemblies ............... SUCCESS [4.982s]
[INFO] OpenJPA Examples .................................. SUCCESS [0.146s]
[INFO] OpenJPA Examples - Simple ......................... SUCCESS [0.366s]
[INFO] OpenJPA Examples - image-gallery .................. SUCCESS [5.662s]
[INFO] OpenJPA Examples - OpenBooks ...................... SUCCESS [6.127s]
[INFO] OpenJPA Integration Tests ......................... SUCCESS [0.074s]
[INFO] OpenJPA Integration Tests - Daytrader ............. SUCCESS [5.555s]
[INFO] OpenJPA Integration Tests - Examples .............. SUCCESS [0.063s]
[INFO] OpenJPA Integration Tests - SLF4JLogFactory ....... SUCCESS [0.488s]
[INFO] OpenJPA Integration Tests - JPA TCK ............... SUCCESS [0.056s]
[INFO] OpenJPA Integration Tests - Bean Validation ....... SUCCESS [3.258s]
[INFO] OpenJPA Integration Tests - JMX Platform MBeans ... SUCCESS [9.858s]
[INFO] OpenJPA Fetching Statistic Tool ................... SUCCESS [0.392s]
[INFO] OpenJPA Fetching Statistic Tool -- WAS Bundle ..... SUCCESS [0.427s]
[INFO] OpenJPA Features .................................. FAILURE [1.805s]
[INFO] ------------------------------------------------------------------------
[INFO] BUILD FAILURE
[INFO] ------------------------------------------------------------------------
[INFO] Total time: 40:25.019s
[INFO] Finished at: Thu Jul 20 22:01:58 UTC 2017
[INFO] Final Memory: 132M/10923M
[INFO] ------------------------------------------------------------------------
[ERROR] Failed to execute goal org.apache.karaf.tooling:karaf-maven-plugin:4.1.1:features-generate-descriptor (compile) on project openjpa-features: Execution compile of goal org.apache.karaf.tooling:karaf-maven-plugin:4.1.1:features-generate-descriptor failed: Unable to load the mojo 'features-generate-descriptor' in the plugin 'org.apache.karaf.tooling:karaf-maven-plugin:4.1.1' due to an API incompatibility: org.codehaus.plexus.component.repository.exception.ComponentLookupException: org/apache/karaf/tooling/features/GenerateDescriptorMojo : Unsupported major.minor version 52.0
[ERROR] -----------------------------------------------------
[ERROR] realm =    plugin>org.apache.karaf.tooling:karaf-maven-plugin:4.1.1
[ERROR] strategy = org.codehaus.plexus.classworlds.strategy.SelfFirstStrategy
[ERROR] urls[0] = file:/home/jenkins/.m2/repository/org/apache/karaf/tooling/karaf-maven-plugin/4.1.1/karaf-maven-plugin-4.1.1.jar
[ERROR] urls[1] = file:/home/jenkins/.m2/repository/org/sonatype/sisu/sisu-inject-bean/2.1.1/sisu-inject-bean-2.1.1.jar
[ERROR] urls[2] = file:/home/jenkins/.m2/repository/org/sonatype/sisu/sisu-guice/2.9.4/sisu-guice-2.9.4-no_aop.jar
[ERROR] urls[3] = file:/home/jenkins/.m2/repository/org/sonatype/aether/aether-util/1.11/aether-util-1.11.jar
[ERROR] urls[4] = file:/home/jenkins/.m2/repository/org/eclipse/aether/aether-api/0.9.0.M2/aether-api-0.9.0.M2.jar
[ERROR] urls[5] = file:/home/jenkins/.m2/repository/org/eclipse/aether/aether-util/0.9.0.M2/aether-util-0.9.0.M2.jar
[ERROR] urls[6] = file:/home/jenkins/.m2/repository/org/codehaus/plexus/plexus-interpolation/1.14/plexus-interpolation-1.14.jar
[ERROR] urls[7] = file:/home/jenkins/.m2/repository/org/codehaus/plexus/plexus-component-annotations/1.5.5/plexus-component-annotations-1.5.5.jar
[ERROR] urls[8] = file:/home/jenkins/.m2/repository/org/sonatype/plexus/plexus-sec-dispatcher/1.3/plexus-sec-dispatcher-1.3.jar
[ERROR] urls[9] = file:/home/jenkins/.m2/repository/org/sonatype/plexus/plexus-cipher/1.4/plexus-cipher-1.4.jar
[ERROR] urls[10] = file:/home/jenkins/.m2/repository/org/apache/maven/plugin-tools/maven-plugin-annotations/3.3/maven-plugin-annotations-3.3.jar
[ERROR] urls[11] = file:/home/jenkins/.m2/repository/org/apache/maven/wagon/wagon-http/2.10/wagon-http-2.10.jar
[ERROR] urls[12] = file:/home/jenkins/.m2/repository/org/apache/maven/wagon/wagon-http-shared/2.10/wagon-http-shared-2.10.jar
[ERROR] urls[13] = file:/home/jenkins/.m2/repository/org/jsoup/jsoup/1.7.2/jsoup-1.7.2.jar
[ERROR] urls[14] = file:/home/jenkins/.m2/repository/commons-lang/commons-lang/2.6/commons-lang-2.6.jar
[ERROR] urls[15] = file:/home/jenkins/.m2/repository/org/apache/httpcomponents/httpclient/4.3.5/httpclient-4.3.5.jar
[ERROR] urls[16] = file:/home/jenkins/.m2/repository/commons-codec/commons-codec/1.6/commons-codec-1.6.jar
[ERROR] urls[17] = file:/home/jenkins/.m2/repository/commons-logging/commons-logging/1.1.3/commons-logging-1.1.3.jar
[ERROR] urls[18] = file:/home/jenkins/.m2/repository/org/apache/httpcomponents/httpcore/4.3.2/httpcore-4.3.2.jar
[ERROR] urls[19] = file:/home/jenkins/.m2/repository/org/apache/karaf/org.apache.karaf.util/4.1.1/org.apache.karaf.util-4.1.1.jar
[ERROR] urls[20] = file:/home/jenkins/.m2/repository/org/apache/felix/org.apache.felix.utils/1.9.0/org.apache.felix.utils-1.9.0.jar
[ERROR] urls[21] = file:/home/jenkins/.m2/repository/org/slf4j/slf4j-api/1.7.12/slf4j-api-1.7.12.jar
[ERROR] urls[22] = file:/home/jenkins/.m2/repository/org/apache/karaf/jaas/org.apache.karaf.jaas.boot/4.1.1/org.apache.karaf.jaas.boot-4.1.1.jar
[ERROR] urls[23] = file:/home/jenkins/.m2/repository/org/apache/karaf/tooling/org.apache.karaf.tools.utils/4.1.1/org.apache.karaf.tools.utils-4.1.1.jar
[ERROR] urls[24] = file:/home/jenkins/.m2/repository/commons-io/commons-io/2.4/commons-io-2.4.jar
[ERROR] urls[25] = file:/home/jenkins/.m2/repository/org/slf4j/slf4j-jdk14/1.7.12/slf4j-jdk14-1.7.12.jar
[ERROR] urls[26] = file:/home/jenkins/.m2/repository/org/apache/maven/shared/maven-filtering/1.0-beta-4/maven-filtering-1.0-beta-4.jar
[ERROR] urls[27] = file:/home/jenkins/.m2/repository/junit/junit/3.8.1/junit-3.8.1.jar
[ERROR] urls[28] = file:/home/jenkins/.m2/repository/org/sonatype/plexus/plexus-build-api/0.0.4/plexus-build-api-0.0.4.jar
[ERROR] urls[29] = file:/home/jenkins/.m2/repository/org/codehaus/plexus/plexus-utils/3.0/plexus-utils-3.0.jar
[ERROR] urls[30] = file:/home/jenkins/.m2/repository/org/apache/felix/maven-bundle-plugin/3.3.0/maven-bundle-plugin-3.3.0.jar
[ERROR] urls[31] = file:/home/jenkins/.m2/repository/biz/aQute/bnd/biz.aQute.bndlib/3.3.0/biz.aQute.bndlib-3.3.0.jar
[ERROR] urls[32] = file:/home/jenkins/.m2/repository/org/apache/maven/maven-archiver/2.6/maven-archiver-2.6.jar
[ERROR] urls[33] = file:/home/jenkins/.m2/repository/org/apache/maven/shared/maven-shared-utils/0.7/maven-shared-utils-0.7.jar
[ERROR] urls[34] = file:/home/jenkins/.m2/repository/com/google/code/findbugs/jsr305/2.0.1/jsr305-2.0.1.jar
[ERROR] urls[35] = file:/home/jenkins/.m2/repository/org/codehaus/plexus/plexus-archiver/2.8.1/plexus-archiver-2.8.1.jar
[ERROR] urls[36] = file:/home/jenkins/.m2/repository/org/codehaus/plexus/plexus-io/2.3.2/plexus-io-2.3.2.jar
[ERROR] urls[37] = file:/home/jenkins/.m2/repository/org/apache/maven/shared/maven-dependency-tree/2.1/maven-dependency-tree-2.1.jar
[ERROR] urls[38] = file:/home/jenkins/.m2/repository/org/apache/maven/doxia/doxia-sink-api/1.0/doxia-sink-api-1.0.jar
[ERROR] urls[39] = file:/home/jenkins/.m2/repository/org/apache/maven/doxia/doxia-site-renderer/1.0/doxia-site-renderer-1.0.jar
[ERROR] urls[40] = file:/home/jenkins/.m2/repository/org/apache/maven/doxia/doxia-core/1.0/doxia-core-1.0.jar
[ERROR] urls[41] = file:/home/jenkins/.m2/repository/org/codehaus/plexus/plexus-i18n/1.0-beta-7/plexus-i18n-1.0-beta-7.jar
[ERROR] urls[42] = file:/home/jenkins/.m2/repository/org/codehaus/plexus/plexus-velocity/1.1.7/plexus-velocity-1.1.7.jar
[ERROR] urls[43] = file:/home/jenkins/.m2/repository/org/apache/velocity/velocity/1.5/velocity-1.5.jar
[ERROR] urls[44] = file:/home/jenkins/.m2/repository/oro/oro/2.0.8/oro-2.0.8.jar
[ERROR] urls[45] = file:/home/jenkins/.m2/repository/org/apache/maven/doxia/doxia-decoration-model/1.0/doxia-decoration-model-1.0.jar
[ERROR] urls[46] = file:/home/jenkins/.m2/repository/commons-collections/commons-collections/3.2/commons-collections-3.2.jar
[ERROR] urls[47] = file:/home/jenkins/.m2/repository/org/apache/maven/doxia/doxia-module-apt/1.0/doxia-module-apt-1.0.jar
[ERROR] urls[48] = file:/home/jenkins/.m2/repository/org/apache/maven/doxia/doxia-module-fml/1.0/doxia-module-fml-1.0.jar
[ERROR] urls[49] = file:/home/jenkins/.m2/repository/org/apache/maven/doxia/doxia-module-xdoc/1.0/doxia-module-xdoc-1.0.jar
[ERROR] urls[50] = file:/home/jenkins/.m2/repository/org/apache/maven/doxia/doxia-module-xhtml/1.0/doxia-module-xhtml-1.0.jar
[ERROR] urls[51] = file:/home/jenkins/.m2/repository/org/jdom/jdom/1.1/jdom-1.1.jar
[ERROR] urls[52] = file:/home/jenkins/.m2/repository/org/apache/felix/org.apache.felix.fileinstall/3.5.8/org.apache.felix.fileinstall-3.5.8.jar
[ERROR] urls[53] = file:/home/jenkins/.m2/repository/org/apache/karaf/features/org.apache.karaf.features.core/4.1.1/org.apache.karaf.features.core-4.1.1.jar
[ERROR] urls[54] = file:/home/jenkins/.m2/repository/org/apache/karaf/profile/org.apache.karaf.profile.core/4.1.1/org.apache.karaf.profile.core-4.1.1.jar
[ERROR] urls[55] = file:/home/jenkins/.m2/repository/org/apache/felix/org.apache.felix.resolver/1.12.0/org.apache.felix.resolver-1.12.0.jar
[ERROR] urls[56] = file:/home/jenkins/.m2/repository/org/ops4j/pax/url/pax-url-wrap/2.5.2/pax-url-wrap-2.5.2-uber.jar
[ERROR] urls[57] = file:/home/jenkins/.m2/repository/org/ops4j/base/ops4j-base-net/1.5.0/ops4j-base-net-1.5.0.jar
[ERROR] urls[58] = file:/home/jenkins/.m2/repository/org/ops4j/base/ops4j-base-lang/1.5.0/ops4j-base-lang-1.5.0.jar
[ERROR] urls[59] = file:/home/jenkins/.m2/repository/org/ops4j/base/ops4j-base-monitors/1.5.0/ops4j-base-monitors-1.5.0.jar
[ERROR] urls[60] = file:/home/jenkins/.m2/repository/org/ops4j/pax/swissbox/pax-swissbox-bnd/1.8.2/pax-swissbox-bnd-1.8.2.jar
[ERROR] urls[61] = file:/home/jenkins/.m2/repository/biz/aQute/bnd/bndlib/2.4.0/bndlib-2.4.0.jar
[ERROR] urls[62] = file:/home/jenkins/.m2/repository/org/ops4j/pax/url/pax-url-commons/2.5.2/pax-url-commons-2.5.2.jar
[ERROR] urls[63] = file:/home/jenkins/.m2/repository/org/ops4j/pax/swissbox/pax-swissbox-property/1.8.2/pax-swissbox-property-1.8.2.jar
[ERROR] urls[64] = file:/home/jenkins/.m2/repository/org/ops4j/base/ops4j-base-util-property/1.5.0/ops4j-base-util-property-1.5.0.jar
[ERROR] urls[65] = file:/home/jenkins/.m2/repository/org/ops4j/pax/url/pax-url-aether/2.5.2/pax-url-aether-2.5.2.jar
[ERROR] urls[66] = file:/home/jenkins/.m2/repository/org/slf4j/jcl-over-slf4j/1.7.12/jcl-over-slf4j-1.7.12.jar
[ERROR] urls[67] = file:/home/jenkins/.m2/repository/org/ops4j/pax/url/pax-url-war/2.5.2/pax-url-war-2.5.2-uber.jar
[ERROR] urls[68] = file:/home/jenkins/.m2/repository/org/ops4j/pax/swissbox/pax-swissbox-optional-jcl/1.8.2/pax-swissbox-optional-jcl-1.8.2.jar
[ERROR] urls[69] = file:/home/jenkins/.m2/repository/org/apache/karaf/deployer/org.apache.karaf.deployer.spring/4.1.1/org.apache.karaf.deployer.spring-4.1.1.jar
[ERROR] urls[70] = file:/home/jenkins/.m2/repository/org/apache/karaf/deployer/org.apache.karaf.deployer.blueprint/4.1.1/org.apache.karaf.deployer.blueprint-4.1.1.jar
[ERROR] urls[71] = file:/home/jenkins/.m2/repository/org/apache/karaf/deployer/org.apache.karaf.deployer.features/4.1.1/org.apache.karaf.deployer.features-4.1.1.jar
[ERROR] urls[72] = file:/home/jenkins/.m2/repository/org/apache/karaf/deployer/org.apache.karaf.deployer.kar/4.1.1/org.apache.karaf.deployer.kar-4.1.1.jar
[ERROR] urls[73] = file:/home/jenkins/.m2/repository/org/apache/karaf/kar/org.apache.karaf.kar.core/4.1.1/org.apache.karaf.kar.core-4.1.1.jar
[ERROR] urls[74] = file:/home/jenkins/.m2/repository/org/apache/karaf/shell/org.apache.karaf.shell.console/4.1.1/org.apache.karaf.shell.console-4.1.1.jar
[ERROR] urls[75] = file:/home/jenkins/.m2/repository/org/jline/jline/3.2.0/jline-3.2.0.jar
[ERROR] urls[76] = file:/home/jenkins/.m2/repository/org/fusesource/jansi/jansi/1.14/jansi-1.14.jar
[ERROR] urls[77] = file:/home/jenkins/.m2/repository/org/apache/karaf/jaas/org.apache.karaf.jaas.modules/4.1.1/org.apache.karaf.jaas.modules-4.1.1.jar
[ERROR] urls[78] = file:/home/jenkins/.m2/repository/org/apache/karaf/jaas/org.apache.karaf.jaas.config/4.1.1/org.apache.karaf.jaas.config-4.1.1.jar
[ERROR] urls[79] = file:/home/jenkins/.m2/repository/org/apache/karaf/shell/org.apache.karaf.shell.core/4.1.1/org.apache.karaf.shell.core-4.1.1.jar
[ERROR] urls[80] = file:/home/jenkins/.m2/repository/org/apache/sshd/sshd-core/1.4.0/sshd-core-1.4.0.jar
[ERROR] urls[81] = file:/home/jenkins/.m2/repository/org/apache/karaf/org.apache.karaf.main/4.1.1/org.apache.karaf.main-4.1.1.jar
[ERROR] urls[82] = file:/home/jenkins/.m2/repository/net/java/dev/jna/jna/4.3.0/jna-4.3.0.jar
[ERROR] urls[83] = file:/home/jenkins/.m2/repository/net/java/dev/jna/jna-platform/4.3.0/jna-platform-4.3.0.jar
[ERROR] urls[84] = file:/home/jenkins/.m2/repository/org/apache/karaf/diagnostic/org.apache.karaf.diagnostic.boot/4.1.1/org.apache.karaf.diagnostic.boot-4.1.1.jar
[ERROR] urls[85] = file:/home/jenkins/.m2/repository/org/apache/commons/commons-compress/1.13/commons-compress-1.13.jar
[ERROR] urls[86] = file:/home/jenkins/.m2/repository/org/osgi/org.osgi.core/6.0.0/org.osgi.core-6.0.0.jar
[ERROR] urls[87] = file:/home/jenkins/.m2/repository/org/apache/xbean/xbean-finder-shaded/3.18/xbean-finder-shaded-3.18.jar
[ERROR] urls[88] = file:/home/jenkins/.m2/repository/org/apache/xbean/xbean-asm5-shaded/3.18/xbean-asm5-shaded-3.18.jar
[ERROR] Number of foreign imports: 1
[ERROR] import: Entry[import  from realm ClassRealm[maven.api, parent: null]]
[ERROR]
[ERROR] -----------------------------------------------------
[ERROR] -> [Help 1]
[ERROR]
[ERROR] To see the full stack trace of the errors, re-run Maven with the -e switch.
[ERROR] Re-run Maven using the -X switch to enable full debug logging.
[ERROR]
[ERROR] For more information about the errors and possible solutions, please read the following articles:
[ERROR] [Help 1] http://cwiki.apache.org/confluence/display/MAVEN/PluginContainerException
[ERROR]
[ERROR] After correcting the problems, you can resume the build with the command
[ERROR]   mvn <goals> -rf :openjpa-features
Build step 'Execute shell' marked build as failure
Archiving artifacts
Setting ANT_1_9_7_HOME=/home/jenkins/tools/ant/apache-ant-1.9.7
Setting JDK_1_7_LATEST__HOME=/home/jenkins/tools/java/latest1.7
Setting MAVEN_3_0_4_HOME=/home/jenkins/tools/maven/apache-maven-3.0.4
[Fast Archiver] No prior successful build to compare, so performing full copy of artifacts
Recording test results
Setting ANT_1_9_7_HOME=/home/jenkins/tools/ant/apache-ant-1.9.7
Setting JDK_1_7_LATEST__HOME=/home/jenkins/tools/java/latest1.7
Setting MAVEN_3_0_4_HOME=/home/jenkins/tools/maven/apache-maven-3.0.4
Setting ANT_1_9_7_HOME=/home/jenkins/tools/ant/apache-ant-1.9.7
Setting JDK_1_7_LATEST__HOME=/home/jenkins/tools/java/latest1.7
Setting MAVEN_3_0_4_HOME=/home/jenkins/tools/maven/apache-maven-3.0.4
Reply | Threaded
Open this post in threaded view
|  
Report Content as Inappropriate

Build failed in Jenkins: OpenJPA-Trunk-new #2

Apache Jenkins Server-2
See <https://builds.apache.org/job/OpenJPA-Trunk-new/2/display/redirect>

------------------------------------------
[...truncated 15.87 KB...]
        at java.net.InetAddress.getAllByName(InetAddress.java:1192)
        at java.net.InetAddress.getAllByName(InetAddress.java:1126)
        at java.net.InetAddress.getByName(InetAddress.java:1076)
        at org.tmatesoft.svn.core.internal.util.SVNSocketFactory.createAddres(SVNSocketFactory.java:205)
        at org.tmatesoft.svn.core.internal.util.SVNSocketFactory._createSSLSocket(SVNSocketFactory.java:105)
        at org.tmatesoft.svn.core.internal.util.SVNSocketFactory.createSSLSocket(SVNSocketFactory.java:92)
        at org.tmatesoft.svn.core.internal.io.dav.http.HTTPConnection.connect(HTTPConnection.java:275)
        at org.tmatesoft.svn.core.internal.io.dav.http.HTTPConnection.request(HTTPConnection.java:454)
        ... 34 more
java.net.UnknownHostException: svn.apache.org: Temporary failure in name resolution
        at java.net.Inet6AddressImpl.lookupAllHostAddr(Native Method)
        at java.net.InetAddress$2.lookupAllHostAddr(InetAddress.java:928)
        at java.net.InetAddress.getAddressesFromNameService(InetAddress.java:1323)
        at java.net.InetAddress.getAllByName0(InetAddress.java:1276)
        at java.net.InetAddress.getAllByName(InetAddress.java:1192)
        at java.net.InetAddress.getAllByName(InetAddress.java:1126)
        at java.net.InetAddress.getByName(InetAddress.java:1076)
        at org.tmatesoft.svn.core.internal.util.SVNSocketFactory.createAddres(SVNSocketFactory.java:205)
        at org.tmatesoft.svn.core.internal.util.SVNSocketFactory._createSSLSocket(SVNSocketFactory.java:105)
        at org.tmatesoft.svn.core.internal.util.SVNSocketFactory.createSSLSocket(SVNSocketFactory.java:92)
        at org.tmatesoft.svn.core.internal.io.dav.http.HTTPConnection.connect(HTTPConnection.java:275)
        at org.tmatesoft.svn.core.internal.io.dav.http.HTTPConnection.request(HTTPConnection.java:454)
Caused: org.tmatesoft.svn.core.SVNException: svn: E175002: unknown host
svn: E175002: OPTIONS request failed on '/repos/asf/openjpa/trunk'
        at org.tmatesoft.svn.core.internal.wc.SVNErrorManager.error(SVNErrorManager.java:112)
        at org.tmatesoft.svn.core.internal.wc.SVNErrorManager.error(SVNErrorManager.java:96)
        at org.tmatesoft.svn.core.internal.io.dav.http.HTTPConnection.request(HTTPConnection.java:803)
        at org.tmatesoft.svn.core.internal.io.dav.http.HTTPConnection.request(HTTPConnection.java:391)
        at org.tmatesoft.svn.core.internal.io.dav.http.HTTPConnection.request(HTTPConnection.java:379)
        at org.tmatesoft.svn.core.internal.io.dav.DAVConnection.performHttpRequest(DAVConnection.java:862)
        at org.tmatesoft.svn.core.internal.io.dav.DAVConnection.exchangeCapabilities(DAVConnection.java:698)
        at org.tmatesoft.svn.core.internal.io.dav.DAVConnection.open(DAVConnection.java:118)
        at org.tmatesoft.svn.core.internal.io.dav.DAVRepository.openConnection(DAVRepository.java:1049)
        at org.tmatesoft.svn.core.internal.io.dav.DAVRepository.getLatestRevision(DAVRepository.java:189)
        at org.tmatesoft.svn.core.internal.wc2.ng.SvnNgRepositoryAccess.getRevisionNumber(SvnNgRepositoryAccess.java:119)
        at org.tmatesoft.svn.core.internal.wc2.SvnRepositoryAccess.getLocations(SvnRepositoryAccess.java:195)
        at org.tmatesoft.svn.core.internal.wc2.ng.SvnNgRepositoryAccess.createRepositoryFor(SvnNgRepositoryAccess.java:46)
        at org.tmatesoft.svn.core.internal.wc2.ng.SvnNgAbstractUpdate.checkout(SvnNgAbstractUpdate.java:815)
        at org.tmatesoft.svn.core.internal.wc2.ng.SvnNgCheckout.run(SvnNgCheckout.java:26)
        at org.tmatesoft.svn.core.internal.wc2.ng.SvnNgCheckout.run(SvnNgCheckout.java:11)
        at org.tmatesoft.svn.core.internal.wc2.ng.SvnNgOperationRunner.run(SvnNgOperationRunner.java:20)
        at org.tmatesoft.svn.core.internal.wc2.SvnOperationRunner.run(SvnOperationRunner.java:21)
        at org.tmatesoft.svn.core.wc2.SvnOperationFactory.run(SvnOperationFactory.java:1235)
        at org.tmatesoft.svn.core.wc2.SvnOperation.run(SvnOperation.java:294)
        at hudson.scm.subversion.CheckoutUpdater$1.perform(CheckoutUpdater.java:119)
        at hudson.scm.subversion.WorkspaceUpdater$UpdateTask.delegateTo(WorkspaceUpdater.java:162)
        at hudson.scm.subversion.WorkspaceUpdater$UpdateTask.delegateTo(WorkspaceUpdater.java:170)
        at hudson.scm.subversion.UpdateUpdater$TaskImpl.perform(UpdateUpdater.java:134)
        at hudson.scm.subversion.WorkspaceUpdater$UpdateTask.delegateTo(WorkspaceUpdater.java:162)
        at hudson.scm.SubversionSCM$CheckOutTask.perform(SubversionSCM.java:1001)
        at hudson.scm.SubversionSCM$CheckOutTask.invoke(SubversionSCM.java:977)
        at hudson.scm.SubversionSCM$CheckOutTask.invoke(SubversionSCM.java:953)
        at hudson.FilePath$FileCallableWrapper.call(FilePath.java:2739)
        at hudson.remoting.UserRequest.perform(UserRequest.java:153)
        at hudson.remoting.UserRequest.perform(UserRequest.java:50)
        at hudson.remoting.Request$2.run(Request.java:336)
        at hudson.remoting.InterceptingExecutorService$1.call(InterceptingExecutorService.java:68)
        at java.util.concurrent.FutureTask.run(FutureTask.java:266)
        at java.util.concurrent.ThreadPoolExecutor.runWorker(ThreadPoolExecutor.java:1142)
        at java.util.concurrent.ThreadPoolExecutor$Worker.run(ThreadPoolExecutor.java:617)
        at java.lang.Thread.run(Thread.java:748)
Caused: java.io.IOException: Failed to check out https://svn.apache.org/repos/asf/openjpa/trunk
        at hudson.scm.subversion.CheckoutUpdater$1.perform(CheckoutUpdater.java:130)
        at hudson.scm.subversion.WorkspaceUpdater$UpdateTask.delegateTo(WorkspaceUpdater.java:162)
        at hudson.scm.subversion.WorkspaceUpdater$UpdateTask.delegateTo(WorkspaceUpdater.java:170)
        at hudson.scm.subversion.UpdateUpdater$TaskImpl.perform(UpdateUpdater.java:134)
        at hudson.scm.subversion.WorkspaceUpdater$UpdateTask.delegateTo(WorkspaceUpdater.java:162)
        at hudson.scm.SubversionSCM$CheckOutTask.perform(SubversionSCM.java:1001)
        at hudson.scm.SubversionSCM$CheckOutTask.invoke(SubversionSCM.java:977)
        at hudson.scm.SubversionSCM$CheckOutTask.invoke(SubversionSCM.java:953)
        at hudson.FilePath$FileCallableWrapper.call(FilePath.java:2739)
        at hudson.remoting.UserRequest.perform(UserRequest.java:153)
        at hudson.remoting.UserRequest.perform(UserRequest.java:50)
        at hudson.remoting.Request$2.run(Request.java:336)
        at hudson.remoting.InterceptingExecutorService$1.call(InterceptingExecutorService.java:68)
        at java.util.concurrent.FutureTask.run(FutureTask.java:266)
        at java.util.concurrent.ThreadPoolExecutor.runWorker(ThreadPoolExecutor.java:1142)
        at java.util.concurrent.ThreadPoolExecutor$Worker.run(ThreadPoolExecutor.java:617)
        at java.lang.Thread.run(Thread.java:748)
        at ......remote call to cassandra13(Native Method)
        at hudson.remoting.Channel.attachCallSiteStackTrace(Channel.java:1545)
        at hudson.remoting.UserResponse.retrieve(UserRequest.java:253)
        at hudson.remoting.Channel.call(Channel.java:830)
        at hudson.FilePath.act(FilePath.java:986)
Caused: java.io.IOException: remote file operation failed: <https://builds.apache.org/job/OpenJPA-Trunk-new/ws/> at hudson.remoting.Channel@8120855:cassandra13
        at hudson.FilePath.act(FilePath.java:993)
        at hudson.FilePath.act(FilePath.java:975)
        at hudson.scm.SubversionSCM.checkout(SubversionSCM.java:902)
        at hudson.scm.SubversionSCM.checkout(SubversionSCM.java:838)
        at hudson.scm.SCM.checkout(SCM.java:495)
        at hudson.model.AbstractProject.checkout(AbstractProject.java:1276)
        at hudson.model.AbstractBuild$AbstractBuildExecution.defaultCheckout(AbstractBuild.java:560)
        at jenkins.scm.SCMCheckoutStrategy.checkout(SCMCheckoutStrategy.java:86)
        at hudson.model.AbstractBuild$AbstractBuildExecution.run(AbstractBuild.java:485)
        at hudson.model.Run.execute(Run.java:1735)
        at hudson.model.FreeStyleBuild.run(FreeStyleBuild.java:43)
        at hudson.model.ResourceController.execute(ResourceController.java:97)
        at hudson.model.Executor.run(Executor.java:405)
Retrying after 10 seconds
Checking out a fresh workspace because there's no workspace at <https://builds.apache.org/job/OpenJPA-Trunk-new/ws/>
Cleaning local Directory .
Checking out https://svn.apache.org/repos/asf/openjpa/trunk at revision '2017-07-26T13:19:14.087 +0000'
ERROR: Failed to check out https://svn.apache.org/repos/asf/openjpa/trunk
org.tmatesoft.svn.core.SVNException: svn: E175002: unknown host
svn: E175002: OPTIONS request failed on '/repos/asf/openjpa/trunk'
        at org.tmatesoft.svn.core.internal.wc.SVNErrorManager.error(SVNErrorManager.java:112)
        at org.tmatesoft.svn.core.internal.wc.SVNErrorManager.error(SVNErrorManager.java:96)
        at org.tmatesoft.svn.core.internal.io.dav.http.HTTPConnection.request(HTTPConnection.java:803)
        at org.tmatesoft.svn.core.internal.io.dav.http.HTTPConnection.request(HTTPConnection.java:391)
        at org.tmatesoft.svn.core.internal.io.dav.http.HTTPConnection.request(HTTPConnection.java:379)
        at org.tmatesoft.svn.core.internal.io.dav.DAVConnection.performHttpRequest(DAVConnection.java:862)
        at org.tmatesoft.svn.core.internal.io.dav.DAVConnection.exchangeCapabilities(DAVConnection.java:698)
        at org.tmatesoft.svn.core.internal.io.dav.DAVConnection.open(DAVConnection.java:118)
        at org.tmatesoft.svn.core.internal.io.dav.DAVRepository.openConnection(DAVRepository.java:1049)
        at org.tmatesoft.svn.core.internal.io.dav.DAVRepository.getLatestRevision(DAVRepository.java:189)
        at org.tmatesoft.svn.core.internal.wc2.ng.SvnNgRepositoryAccess.getRevisionNumber(SvnNgRepositoryAccess.java:119)
        at org.tmatesoft.svn.core.internal.wc2.SvnRepositoryAccess.getLocations(SvnRepositoryAccess.java:195)
        at org.tmatesoft.svn.core.internal.wc2.ng.SvnNgRepositoryAccess.createRepositoryFor(SvnNgRepositoryAccess.java:46)
        at org.tmatesoft.svn.core.internal.wc2.ng.SvnNgAbstractUpdate.checkout(SvnNgAbstractUpdate.java:815)
        at org.tmatesoft.svn.core.internal.wc2.ng.SvnNgCheckout.run(SvnNgCheckout.java:26)
        at org.tmatesoft.svn.core.internal.wc2.ng.SvnNgCheckout.run(SvnNgCheckout.java:11)
        at org.tmatesoft.svn.core.internal.wc2.ng.SvnNgOperationRunner.run(SvnNgOperationRunner.java:20)
        at org.tmatesoft.svn.core.internal.wc2.SvnOperationRunner.run(SvnOperationRunner.java:21)
        at org.tmatesoft.svn.core.wc2.SvnOperationFactory.run(SvnOperationFactory.java:1235)
        at org.tmatesoft.svn.core.wc2.SvnOperation.run(SvnOperation.java:294)
        at hudson.scm.subversion.CheckoutUpdater$1.perform(CheckoutUpdater.java:119)
        at hudson.scm.subversion.WorkspaceUpdater$UpdateTask.delegateTo(WorkspaceUpdater.java:162)
        at hudson.scm.subversion.WorkspaceUpdater$UpdateTask.delegateTo(WorkspaceUpdater.java:170)
        at hudson.scm.subversion.UpdateUpdater$TaskImpl.perform(UpdateUpdater.java:134)
        at hudson.scm.subversion.WorkspaceUpdater$UpdateTask.delegateTo(WorkspaceUpdater.java:162)
        at hudson.scm.SubversionSCM$CheckOutTask.perform(SubversionSCM.java:1001)
        at hudson.scm.SubversionSCM$CheckOutTask.invoke(SubversionSCM.java:977)
        at hudson.scm.SubversionSCM$CheckOutTask.invoke(SubversionSCM.java:953)
        at hudson.FilePath$FileCallableWrapper.call(FilePath.java:2739)
        at hudson.remoting.UserRequest.perform(UserRequest.java:153)
        at hudson.remoting.UserRequest.perform(UserRequest.java:50)
        at hudson.remoting.Request$2.run(Request.java:336)
        at hudson.remoting.InterceptingExecutorService$1.call(InterceptingExecutorService.java:68)
        at java.util.concurrent.FutureTask.run(FutureTask.java:266)
        at java.util.concurrent.ThreadPoolExecutor.runWorker(ThreadPoolExecutor.java:1142)
        at java.util.concurrent.ThreadPoolExecutor$Worker.run(ThreadPoolExecutor.java:617)
        at java.lang.Thread.run(Thread.java:748)
Caused by: java.net.UnknownHostException: svn.apache.org: Temporary failure in name resolution
        at java.net.Inet6AddressImpl.lookupAllHostAddr(Native Method)
        at java.net.InetAddress$2.lookupAllHostAddr(InetAddress.java:928)
        at java.net.InetAddress.getAddressesFromNameService(InetAddress.java:1323)
        at java.net.InetAddress.getAllByName0(InetAddress.java:1276)
        at java.net.InetAddress.getAllByName(InetAddress.java:1192)
        at java.net.InetAddress.getAllByName(InetAddress.java:1126)
        at java.net.InetAddress.getByName(InetAddress.java:1076)
        at org.tmatesoft.svn.core.internal.util.SVNSocketFactory.createAddres(SVNSocketFactory.java:205)
        at org.tmatesoft.svn.core.internal.util.SVNSocketFactory._createSSLSocket(SVNSocketFactory.java:105)
        at org.tmatesoft.svn.core.internal.util.SVNSocketFactory.createSSLSocket(SVNSocketFactory.java:92)
        at org.tmatesoft.svn.core.internal.io.dav.http.HTTPConnection.connect(HTTPConnection.java:275)
        at org.tmatesoft.svn.core.internal.io.dav.http.HTTPConnection.request(HTTPConnection.java:454)
        ... 34 more
java.net.UnknownHostException: svn.apache.org: Temporary failure in name resolution
        at java.net.Inet6AddressImpl.lookupAllHostAddr(Native Method)
        at java.net.InetAddress$2.lookupAllHostAddr(InetAddress.java:928)
        at java.net.InetAddress.getAddressesFromNameService(InetAddress.java:1323)
        at java.net.InetAddress.getAllByName0(InetAddress.java:1276)
        at java.net.InetAddress.getAllByName(InetAddress.java:1192)
        at java.net.InetAddress.getAllByName(InetAddress.java:1126)
        at java.net.InetAddress.getByName(InetAddress.java:1076)
        at org.tmatesoft.svn.core.internal.util.SVNSocketFactory.createAddres(SVNSocketFactory.java:205)
        at org.tmatesoft.svn.core.internal.util.SVNSocketFactory._createSSLSocket(SVNSocketFactory.java:105)
        at org.tmatesoft.svn.core.internal.util.SVNSocketFactory.createSSLSocket(SVNSocketFactory.java:92)
        at org.tmatesoft.svn.core.internal.io.dav.http.HTTPConnection.connect(HTTPConnection.java:275)
        at org.tmatesoft.svn.core.internal.io.dav.http.HTTPConnection.request(HTTPConnection.java:454)
Caused: org.tmatesoft.svn.core.SVNException: svn: E175002: unknown host
svn: E175002: OPTIONS request failed on '/repos/asf/openjpa/trunk'
        at org.tmatesoft.svn.core.internal.wc.SVNErrorManager.error(SVNErrorManager.java:112)
        at org.tmatesoft.svn.core.internal.wc.SVNErrorManager.error(SVNErrorManager.java:96)
        at org.tmatesoft.svn.core.internal.io.dav.http.HTTPConnection.request(HTTPConnection.java:803)
        at org.tmatesoft.svn.core.internal.io.dav.http.HTTPConnection.request(HTTPConnection.java:391)
        at org.tmatesoft.svn.core.internal.io.dav.http.HTTPConnection.request(HTTPConnection.java:379)
        at org.tmatesoft.svn.core.internal.io.dav.DAVConnection.performHttpRequest(DAVConnection.java:862)
        at org.tmatesoft.svn.core.internal.io.dav.DAVConnection.exchangeCapabilities(DAVConnection.java:698)
        at org.tmatesoft.svn.core.internal.io.dav.DAVConnection.open(DAVConnection.java:118)
        at org.tmatesoft.svn.core.internal.io.dav.DAVRepository.openConnection(DAVRepository.java:1049)
        at org.tmatesoft.svn.core.internal.io.dav.DAVRepository.getLatestRevision(DAVRepository.java:189)
        at org.tmatesoft.svn.core.internal.wc2.ng.SvnNgRepositoryAccess.getRevisionNumber(SvnNgRepositoryAccess.java:119)
        at org.tmatesoft.svn.core.internal.wc2.SvnRepositoryAccess.getLocations(SvnRepositoryAccess.java:195)
        at org.tmatesoft.svn.core.internal.wc2.ng.SvnNgRepositoryAccess.createRepositoryFor(SvnNgRepositoryAccess.java:46)
        at org.tmatesoft.svn.core.internal.wc2.ng.SvnNgAbstractUpdate.checkout(SvnNgAbstractUpdate.java:815)
        at org.tmatesoft.svn.core.internal.wc2.ng.SvnNgCheckout.run(SvnNgCheckout.java:26)
        at org.tmatesoft.svn.core.internal.wc2.ng.SvnNgCheckout.run(SvnNgCheckout.java:11)
        at org.tmatesoft.svn.core.internal.wc2.ng.SvnNgOperationRunner.run(SvnNgOperationRunner.java:20)
        at org.tmatesoft.svn.core.internal.wc2.SvnOperationRunner.run(SvnOperationRunner.java:21)
        at org.tmatesoft.svn.core.wc2.SvnOperationFactory.run(SvnOperationFactory.java:1235)
        at org.tmatesoft.svn.core.wc2.SvnOperation.run(SvnOperation.java:294)
        at hudson.scm.subversion.CheckoutUpdater$1.perform(CheckoutUpdater.java:119)
        at hudson.scm.subversion.WorkspaceUpdater$UpdateTask.delegateTo(WorkspaceUpdater.java:162)
        at hudson.scm.subversion.WorkspaceUpdater$UpdateTask.delegateTo(WorkspaceUpdater.java:170)
        at hudson.scm.subversion.UpdateUpdater$TaskImpl.perform(UpdateUpdater.java:134)
        at hudson.scm.subversion.WorkspaceUpdater$UpdateTask.delegateTo(WorkspaceUpdater.java:162)
        at hudson.scm.SubversionSCM$CheckOutTask.perform(SubversionSCM.java:1001)
        at hudson.scm.SubversionSCM$CheckOutTask.invoke(SubversionSCM.java:977)
        at hudson.scm.SubversionSCM$CheckOutTask.invoke(SubversionSCM.java:953)
        at hudson.FilePath$FileCallableWrapper.call(FilePath.java:2739)
        at hudson.remoting.UserRequest.perform(UserRequest.java:153)
        at hudson.remoting.UserRequest.perform(UserRequest.java:50)
        at hudson.remoting.Request$2.run(Request.java:336)
        at hudson.remoting.InterceptingExecutorService$1.call(InterceptingExecutorService.java:68)
        at java.util.concurrent.FutureTask.run(FutureTask.java:266)
        at java.util.concurrent.ThreadPoolExecutor.runWorker(ThreadPoolExecutor.java:1142)
        at java.util.concurrent.ThreadPoolExecutor$Worker.run(ThreadPoolExecutor.java:617)
        at java.lang.Thread.run(Thread.java:748)
Caused: java.io.IOException: Failed to check out https://svn.apache.org/repos/asf/openjpa/trunk
        at hudson.scm.subversion.CheckoutUpdater$1.perform(CheckoutUpdater.java:130)
        at hudson.scm.subversion.WorkspaceUpdater$UpdateTask.delegateTo(WorkspaceUpdater.java:162)
        at hudson.scm.subversion.WorkspaceUpdater$UpdateTask.delegateTo(WorkspaceUpdater.java:170)
        at hudson.scm.subversion.UpdateUpdater$TaskImpl.perform(UpdateUpdater.java:134)
        at hudson.scm.subversion.WorkspaceUpdater$UpdateTask.delegateTo(WorkspaceUpdater.java:162)
        at hudson.scm.SubversionSCM$CheckOutTask.perform(SubversionSCM.java:1001)
        at hudson.scm.SubversionSCM$CheckOutTask.invoke(SubversionSCM.java:977)
        at hudson.scm.SubversionSCM$CheckOutTask.invoke(SubversionSCM.java:953)
        at hudson.FilePath$FileCallableWrapper.call(FilePath.java:2739)
        at hudson.remoting.UserRequest.perform(UserRequest.java:153)
        at hudson.remoting.UserRequest.perform(UserRequest.java:50)
        at hudson.remoting.Request$2.run(Request.java:336)
        at hudson.remoting.InterceptingExecutorService$1.call(InterceptingExecutorService.java:68)
        at java.util.concurrent.FutureTask.run(FutureTask.java:266)
        at java.util.concurrent.ThreadPoolExecutor.runWorker(ThreadPoolExecutor.java:1142)
        at java.util.concurrent.ThreadPoolExecutor$Worker.run(ThreadPoolExecutor.java:617)
        at java.lang.Thread.run(Thread.java:748)
        at ......remote call to cassandra13(Native Method)
        at hudson.remoting.Channel.attachCallSiteStackTrace(Channel.java:1545)
        at hudson.remoting.UserResponse.retrieve(UserRequest.java:253)
        at hudson.remoting.Channel.call(Channel.java:830)
        at hudson.FilePath.act(FilePath.java:986)
Caused: java.io.IOException: remote file operation failed: <https://builds.apache.org/job/OpenJPA-Trunk-new/ws/> at hudson.remoting.Channel@8120855:cassandra13
        at hudson.FilePath.act(FilePath.java:993)
        at hudson.FilePath.act(FilePath.java:975)
        at hudson.scm.SubversionSCM.checkout(SubversionSCM.java:902)
        at hudson.scm.SubversionSCM.checkout(SubversionSCM.java:838)
        at hudson.scm.SCM.checkout(SCM.java:495)
        at hudson.model.AbstractProject.checkout(AbstractProject.java:1276)
        at hudson.model.AbstractBuild$AbstractBuildExecution.defaultCheckout(AbstractBuild.java:560)
        at jenkins.scm.SCMCheckoutStrategy.checkout(SCMCheckoutStrategy.java:86)
        at hudson.model.AbstractBuild$AbstractBuildExecution.run(AbstractBuild.java:485)
        at hudson.model.Run.execute(Run.java:1735)
        at hudson.model.FreeStyleBuild.run(FreeStyleBuild.java:43)
        at hudson.model.ResourceController.execute(ResourceController.java:97)
        at hudson.model.Executor.run(Executor.java:405)
Archiving artifacts
Recording test results
ERROR: Step ‘Publish JUnit test result report’ failed: No test report files were found. Configuration error?

Reply | Threaded
Open this post in threaded view
|  
Report Content as Inappropriate

Build failed in Jenkins: OpenJPA-Trunk-new #3

Apache Jenkins Server-2
See <https://builds.apache.org/job/OpenJPA-Trunk-new/3/display/redirect>

------------------------------------------
[...truncated 608.47 KB...]
AU        openjpa-lib/src/main/java/org/apache/openjpa/lib/ant/AbstractTask.java
A         openjpa-lib/src/main/java/org/apache/openjpa/lib/identifier
AU        openjpa-lib/src/main/java/org/apache/openjpa/lib/identifier/Identifier.java
AU        openjpa-lib/src/main/java/org/apache/openjpa/lib/identifier/IdentifierUtilImpl.java
AU        openjpa-lib/src/main/java/org/apache/openjpa/lib/identifier/IdentifierImpl.java
AU        openjpa-lib/src/main/java/org/apache/openjpa/lib/identifier/IdentifierConfiguration.java
AU        openjpa-lib/src/main/java/org/apache/openjpa/lib/identifier/IdentifierRule.java
AU        openjpa-lib/src/main/java/org/apache/openjpa/lib/identifier/IdentifierUtil.java
A         openjpa-lib/src/main/java/org/apache/openjpa/lib/jdbc
AU        openjpa-lib/src/main/java/org/apache/openjpa/lib/jdbc/AbstractJDBCListener.java
AU        openjpa-lib/src/main/java/org/apache/openjpa/lib/jdbc/ConfiguringConnectionDecorator.java
AU        openjpa-lib/src/main/java/org/apache/openjpa/lib/jdbc/ConnectionDecorator.java
AU        openjpa-lib/src/main/java/org/apache/openjpa/lib/jdbc/JDBCEvent.java
AU        openjpa-lib/src/main/java/org/apache/openjpa/lib/jdbc/ReportingSQLException.java
AU        openjpa-lib/src/main/java/org/apache/openjpa/lib/jdbc/DelegatingCallableStatement.java
AU        openjpa-lib/src/main/java/org/apache/openjpa/lib/jdbc/JDBCListener.java
AU        openjpa-lib/src/main/java/org/apache/openjpa/lib/jdbc/LoggingConnectionDecorator.java
AU        openjpa-lib/src/main/java/org/apache/openjpa/lib/jdbc/DelegatingPreparedStatement.java
AU        openjpa-lib/src/main/java/org/apache/openjpa/lib/jdbc/DelegatingResultSet.java
AU        openjpa-lib/src/main/java/org/apache/openjpa/lib/jdbc/DelegatingDataSource.java
A         openjpa-lib/src/main/java/org/apache/openjpa/lib/jdbc/package.html
AU        openjpa-lib/src/main/java/org/apache/openjpa/lib/jdbc/DataSourceLogs.java
AU        openjpa-lib/src/main/java/org/apache/openjpa/lib/jdbc/SQLFormatter.java
AU        openjpa-lib/src/main/java/org/apache/openjpa/lib/jdbc/DelegatingConnection.java
AU        openjpa-lib/src/main/java/org/apache/openjpa/lib/jdbc/JDBCEventConnectionDecorator.java
AU        openjpa-lib/src/main/java/org/apache/openjpa/lib/jdbc/DelegatingStatement.java
AU        openjpa-lib/src/main/java/org/apache/openjpa/lib/jdbc/DelegatingDatabaseMetaData.java
AU        openjpa-lib/src/main/java/org/apache/openjpa/lib/jdbc/DecoratingDataSource.java
A         openjpa-lib/src/main/java/org/apache/openjpa/lib/instrumentation
AU        openjpa-lib/src/main/java/org/apache/openjpa/lib/instrumentation/AbstractInstrumentationProvider.java
AU        openjpa-lib/src/main/java/org/apache/openjpa/lib/instrumentation/Instrument.java
AU        openjpa-lib/src/main/java/org/apache/openjpa/lib/instrumentation/InstrumentationLevel.java
AU        openjpa-lib/src/main/java/org/apache/openjpa/lib/instrumentation/AbstractInstrument.java
AU        openjpa-lib/src/main/java/org/apache/openjpa/lib/instrumentation/InstrumentationProvider.java
AU        openjpa-lib/pom.xml
 U        .
At revision 1803095

Setting ANT_1_9_7_HOME=/home/jenkins/tools/ant/apache-ant-1.9.7
Setting JDK_1_7_LATEST__HOME=/home/jenkins/tools/java/latest1.7
Setting MAVEN_3_0_4_HOME=/home/jenkins/tools/maven/apache-maven-3.0.4
[OpenJPA-Trunk-new] $ /bin/bash -xe /tmp/jenkins199373634019019236.sh
+ export ANT_HOME=/home/jenkins/tools/ant/apache-ant-1.9.7
+ ANT_HOME=/home/jenkins/tools/ant/apache-ant-1.9.7
+ export JAVA_HOME=/home/jenkins/tools/java/latest1.7
+ JAVA_HOME=/home/jenkins/tools/java/latest1.7
+ export M2_HOME=/home/jenkins/tools/maven/apache-maven-3.0.4
+ M2_HOME=/home/jenkins/tools/maven/apache-maven-3.0.4
+ export PATH=/home/jenkins/tools/ant/apache-ant-1.9.7/bin:/home/jenkins/tools/java/latest1.7/bin:/home/jenkins/tools/maven/apache-maven-3.0.4/bin:/home/jenkins/tools/java/latest1.8/bin:/usr/local/sbin:/usr/local/bin:/usr/sbin:/usr/bin:/sbin:/bin:/usr/games:/usr/local/games
+ PATH=/home/jenkins/tools/ant/apache-ant-1.9.7/bin:/home/jenkins/tools/java/latest1.7/bin:/home/jenkins/tools/maven/apache-maven-3.0.4/bin:/home/jenkins/tools/java/latest1.8/bin:/usr/local/sbin:/usr/local/bin:/usr/sbin:/usr/bin:/sbin:/bin:/usr/games:/usr/local/games
+ mvn clean install
[INFO] Scanning for projects...
[WARNING]
[WARNING] Some problems were encountered while building the effective model for org.apache.openjpa:openjpa-features:pom:3.0.0-SNAPSHOT
[WARNING] 'build.plugins.plugin.version' for org.apache.karaf.tooling:karaf-maven-plugin is missing. @ line 31, column 12
[WARNING] 'build.plugins.plugin.version' for org.codehaus.mojo:build-helper-maven-plugin is missing. @ line 49, column 12
[WARNING]
[WARNING] It is highly recommended to fix these problems because they threaten the stability of your build.
[WARNING]
[WARNING] For this reason, future Maven versions might no longer support building such malformed projects.
[WARNING]
[INFO] ------------------------------------------------------------------------
[INFO] Reactor Build Order:
[INFO]
[INFO] OpenJPA Parent POM
[INFO] OpenJPA Utilities Library
[INFO] OpenJPA Kernel
[INFO] OpenJPA JDBC
[INFO] OpenJPA Persistence
[INFO] OpenJPA Persistence JDBC
[INFO] OpenJPA Persistence Locking Tests
[INFO] OpenJPA tools
[INFO] OpenJPA Maven Plugin
[INFO] OpenJPA XML Store
[INFO] OpenJPA Slice
[INFO] OpenJPA JEST
[INFO] OpenJPA Aggregate Jar
[INFO] OpenJPA Aggregate Jar with Dependencies
[INFO] OpenJPA Project Docs and Assemblies
[INFO] OpenJPA Examples
[INFO] OpenJPA Examples - Simple
[INFO] OpenJPA Examples - image-gallery
[INFO] OpenJPA Examples - OpenBooks
[INFO] OpenJPA Integration Tests
[INFO] OpenJPA Integration Tests - Daytrader
[INFO] OpenJPA Integration Tests - Examples
[INFO] OpenJPA Integration Tests - SLF4JLogFactory
[INFO] OpenJPA Integration Tests - JPA TCK
[INFO] OpenJPA Integration Tests - Bean Validation
[INFO] OpenJPA Integration Tests - JMX Platform MBeans
[INFO] OpenJPA Fetching Statistic Tool
[INFO] OpenJPA Fetching Statistic Tool -- WAS Bundle
[INFO] OpenJPA Features
[INFO]                                                                        
[INFO] ------------------------------------------------------------------------
[INFO] Building OpenJPA Parent POM 3.0.0-SNAPSHOT
[INFO] ------------------------------------------------------------------------
[INFO]
[INFO] --- maven-clean-plugin:3.0.0:clean (default-clean) @ openjpa-parent ---
[INFO]
[INFO] --- buildnumber-maven-plugin:1.4:create (default) @ openjpa-parent ---
[INFO] Executing: /bin/sh -c cd '<https://builds.apache.org/job/OpenJPA-Trunk-new/ws/'> && 'svn' '--non-interactive' 'info'
[INFO] Working directory: <https://builds.apache.org/job/OpenJPA-Trunk-new/ws/>
[INFO] Storing buildNumber: 1803095 at timestamp: July 26, 2017 at 7:01 PM
[INFO] Executing: /bin/sh -c cd '<https://builds.apache.org/job/OpenJPA-Trunk-new/ws/'> && 'svn' '--non-interactive' 'info'
[INFO] Working directory: <https://builds.apache.org/job/OpenJPA-Trunk-new/ws/>
[INFO] Storing buildScmBranch: trunk
[INFO]
[INFO] --- maven-enforcer-plugin:1.4.1:enforce (default) @ openjpa-parent ---
[INFO]
[INFO] --- maven-checkstyle-plugin:2.9:checkstyle (default) @ openjpa-parent ---
Setting property: classpath.resource.loader.class => 'org.codehaus.plexus.velocity.ContextClassLoaderResourceLoader'.
Setting property: site.resource.loader.class => 'org.codehaus.plexus.velocity.SiteResourceLoader'.
Setting property: velocimacro.messages.on => 'false'.
Setting property: resource.loader => 'classpath,site'.
Setting property: runtime.log.invalid.references => 'false'.
Setting property: resource.manager.logwhenfound => 'false'.
Setting property: velocimacro.permissions.allow.inline.to.replace.global => 'true'.
Setting property: classpath.resource.loader.class => 'org.codehaus.plexus.velocity.ContextClassLoaderResourceLoader'.
Setting property: site.resource.loader.class => 'org.codehaus.plexus.velocity.SiteResourceLoader'.
Setting property: velocimacro.messages.on => 'false'.
Setting property: resource.loader => 'classpath,site'.
Setting property: runtime.log.invalid.references => 'false'.
Setting property: resource.manager.logwhenfound => 'false'.
[INFO]
[INFO] --- maven-remote-resources-plugin:1.5:process (process-resource-bundles) @ openjpa-parent ---
[INFO]
[INFO] --- maven-compiler-plugin:3.5.1:testCompile (test-source-compile) @ openjpa-parent ---
[INFO] No sources to compile
[INFO]
[INFO] --- maven-site-plugin:3.5.1:attach-descriptor (attach-descriptor) @ openjpa-parent ---
[INFO]
[INFO] --- apache-rat-plugin:0.11:check (default) @ openjpa-parent ---
[INFO] 51 implicit excludes (use -debug for more details).
[INFO] Exclude: **/.*/**
[INFO] Exclude: **/target/**/*
[INFO] 4932 resources included (use -debug for more details)
[INFO] Rat check: Summary of files. Unapproved: 0 unknown: 0 generated: 0 approved: 4923 licence.
[INFO]
[INFO] --- maven-install-plugin:2.5.2:install (default-install) @ openjpa-parent ---
[INFO] Installing <https://builds.apache.org/job/OpenJPA-Trunk-new/ws/pom.xml> to /home/jenkins/.m2/repository/org/apache/openjpa/openjpa-parent/3.0.0-SNAPSHOT/openjpa-parent-3.0.0-SNAPSHOT.pom
[INFO] Installing <https://builds.apache.org/job/OpenJPA-Trunk-new/ws/target/openjpa-parent-3.0.0-SNAPSHOT-site.xml> to /home/jenkins/.m2/repository/org/apache/openjpa/openjpa-parent/3.0.0-SNAPSHOT/openjpa-parent-3.0.0-SNAPSHOT-site.xml
[INFO]                                                                        
[INFO] ------------------------------------------------------------------------
[INFO] Building OpenJPA Utilities Library 3.0.0-SNAPSHOT
[INFO] ------------------------------------------------------------------------
Downloading: http://repo.maven.apache.org/maven2/org/apache/ant/ant/1.9.7/ant-1.9.7.pom
4/10 KB   8/10 KB   10/10 KB              Downloaded: http://repo.maven.apache.org/maven2/org/apache/ant/ant/1.9.7/ant-1.9.7.pom (10 KB at 68.6 KB/sec)
Downloading: http://repo.maven.apache.org/maven2/org/apache/ant/ant-parent/1.9.7/ant-parent-1.9.7.pom
4/6 KB     6/6 KB            Downloaded: http://repo.maven.apache.org/maven2/org/apache/ant/ant-parent/1.9.7/ant-parent-1.9.7.pom (6 KB at 342.1 KB/sec)
Downloading: http://repo.maven.apache.org/maven2/org/apache/ant/ant-launcher/1.9.7/ant-launcher-1.9.7.pom
3/3 KB            Downloaded: http://repo.maven.apache.org/maven2/org/apache/ant/ant-launcher/1.9.7/ant-launcher-1.9.7.pom (3 KB at 49.6 KB/sec)
Downloading: http://repo.maven.apache.org/maven2/org/apache/geronimo/specs/geronimo-validation_1.1_spec/1.0/geronimo-validation_1.1_spec-1.0.pom
4/6 KB   6/6 KB            Downloaded: http://repo.maven.apache.org/maven2/org/apache/geronimo/specs/geronimo-validation_1.1_spec/1.0/geronimo-validation_1.1_spec-1.0.pom (6 KB at 279.2 KB/sec)
Downloading: http://repo.maven.apache.org/maven2/org/apache/ant/ant/1.9.7/ant-1.9.7.jar
Downloading: http://repo.maven.apache.org/maven2/org/apache/ant/ant-launcher/1.9.7/ant-launcher-1.9.7.jar
Downloading: http://repo.maven.apache.org/maven2/org/apache/geronimo/specs/geronimo-validation_1.1_spec/1.0/geronimo-validation_1.1_spec-1.0.jar
3/1989 KB   7/1989 KB   11/1989 KB   15/1989 KB   19/1989 KB   23/1989 KB   23/1989 KB   4/18 KB   27/1989 KB   4/18 KB   27/1989 KB   7/18 KB   31/1989 KB   7/18 KB   31/1989 KB   11/18 KB   35/1989 KB   11/18 KB   35/1989 KB   11/18 KB   4/74 KB   35/1989 KB   14/18 KB   4/74 KB   39/1989 KB   14/18 KB   4/74 KB   39/1989 KB   14/18 KB   7/74 KB   39/1989 KB   18/18 KB   7/74 KB   39/1989 KB   18/18 KB   11/74 KB   43/1989 KB   18/18 KB   11/74 KB   43/1989 KB   18/18 KB   11/74 KB   43/1989 KB   18/18 KB   14/74 KB   47/1989 KB   18/18 KB   14/74 KB   47/1989 KB   18/18 KB   18/74 KB   51/1989 KB   18/18 KB   18/74 KB   51/1989 KB   18/18 KB   22/74 KB   55/1989 KB   18/18 KB   22/74 KB   55/1989 KB   18/18 KB   26/74 KB   59/1989 KB   18/18 KB   26/74 KB   59/1989 KB   18/18 KB   30/74 KB   63/1989 KB   18/18 KB   30/74 KB   63/1989 KB   18/18 KB   34/74 KB   67/1989 KB   18/18 KB   34/74 KB   67/1989 KB   18/18 KB   38/74 KB   71/1989 KB   18/18 KB   38/74 KB   71/1989 KB   18/18 KB   42/74 KB                                      75/1989 KB   42/74 KB              75/1989 KB   46/74 KB   Downloaded: http://repo.maven.apache.org/maven2/org/apache/ant/ant-launcher/1.9.7/ant-launcher-1.9.7.jar (18 KB at 597.8 KB/sec)
79/1989 KB   46/74 KB   79/1989 KB   50/74 KB   83/1989 KB   50/74 KB   83/1989 KB   54/74 KB   87/1989 KB   54/74 KB   87/1989 KB   58/74 KB   91/1989 KB   58/74 KB   91/1989 KB   62/74 KB   95/1989 KB   62/74 KB   95/1989 KB   66/74 KB   99/1989 KB   66/74 KB   99/1989 KB   70/74 KB   103/1989 KB   70/74 KB   103/1989 KB   74/74 KB   107/1989 KB   74/74 KB   107/1989 KB   74/74 KB   111/1989 KB   74/74 KB   115/1989 KB   74/74 KB   119/1989 KB   74/74 KB   123/1989 KB   74/74 KB   127/1989 KB   74/74 KB   131/1989 KB   74/74 KB   135/1989 KB   74/74 KB   139/1989 KB   74/74 KB   143/1989 KB   74/74 KB   147/1989 KB   74/74 KB   151/1989 KB   74/74 KB                            Downloaded: http://repo.maven.apache.org/maven2/org/apache/geronimo/specs/geronimo-validation_1.1_spec/1.0/geronimo-validation_1.1_spec-1.0.jar (74 KB at 1568.0 KB/sec)
155/1989 KB              159/1989 KB   163/1989 KB   167/1989 KB   171/1989 KB   175/1989 KB   179/1989 KB   183/1989 KB   187/1989 KB   191/1989 KB   195/1989 KB   199/1989 KB   203/1989 KB   207/1989 KB   211/1989 KB   215/1989 KB   219/1989 KB   223/1989 KB   227/1989 KB   231/1989 KB   235/1989 KB   239/1989 KB   243/1989 KB   247/1989 KB   251/1989 KB   255/1989 KB   259/1989 KB   263/1989 KB   267/1989 KB   271/1989 KB   275/1989 KB   279/1989 KB   283/1989 KB   287/1989 KB   291/1989 KB   295/1989 KB   299/1989 KB   303/1989 KB   307/1989 KB   311/1989 KB   315/1989 KB   319/1989 KB   323/1989 KB   327/1989 KB   331/1989 KB   335/1989 KB   339/1989 KB   343/1989 KB   347/1989 KB   351/1989 KB   355/1989 KB   359/1989 KB   363/1989 KB   367/1989 KB   371/1989 KB   375/1989 KB   379/1989 KB   383/1989 KB   387/1989 KB   391/1989 KB   395/1989 KB   399/1989 KB   403/1989 KB   407/1989 KB   411/1989 KB   415/1989 KB   419/1989 KB   423/1989 KB   427/1989 KB   431/1989 KB   435/1989 KB   439/1989 KB   443/1989 KB   447/1989 KB   451/1989 KB   455/1989 KB   459/1989 KB   463/1989 KB   467/1989 KB   471/1989 KB   475/1989 KB   479/1989 KB   483/1989 KB   487/1989 KB   491/1989 KB   495/1989 KB   499/1989 KB   503/1989 KB   507/1989 KB   511/1989 KB   515/1989 KB   519/1989 KB   523/1989 KB   527/1989 KB   531/1989 KB   535/1989 KB   539/1989 KB   543/1989 KB   547/1989 KB   551/1989 KB   555/1989 KB   559/1989 KB   563/1989 KB   567/1989 KB   571/1989 KB   575/1989 KB   579/1989 KB   583/1989 KB   587/1989 KB   591/1989 KB   595/1989 KB   599/1989 KB   603/1989 KB   607/1989 KB   611/1989 KB   615/1989 KB   619/1989 KB   623/1989 KB   627/1989 KB   631/1989 KB   635/1989 KB   639/1989 KB   643/1989 KB   647/1989 KB   651/1989 KB   655/1989 KB   659/1989 KB   663/1989 KB   667/1989 KB   671/1989 KB   675/1989 KB   679/1989 KB   683/1989 KB   687/1989 KB   691/1989 KB   695/1989 KB   699/1989 KB   703/1989 KB   707/1989 KB   711/1989 KB   715/1989 KB   719/1989 KB   723/1989 KB   727/1989 KB   731/1989 KB   735/1989 KB   739/1989 KB   743/1989 KB   747/1989 KB   751/1989 KB   755/1989 KB   759/1989 KB   763/1989 KB   767/1989 KB   771/1989 KB   775/1989 KB   779/1989 KB   783/1989 KB   787/1989 KB   791/1989 KB   795/1989 KB   799/1989 KB   803/1989 KB   807/1989 KB   811/1989 KB   815/1989 KB   819/1989 KB   823/1989 KB   827/1989 KB   831/1989 KB   835/1989 KB   839/1989 KB   843/1989 KB   847/1989 KB   851/1989 KB   855/1989 KB   859/1989 KB   863/1989 KB   867/1989 KB   871/1989 KB   875/1989 KB   879/1989 KB   883/1989 KB   887/1989 KB   891/1989 KB   895/1989 KB   899/1989 KB   903/1989 KB   907/1989 KB   911/1989 KB   915/1989 KB   918/1989 KB   919/1989 KB   923/1989 KB   927/1989 KB   931/1989 KB   933/1989 KB   937/1989 KB   941/1989 KB   945/1989 KB   947/1989 KB   951/1989 KB   955/1989 KB   959/1989 KB   961/1989 KB   965/1989 KB   969/1989 KB   973/1989 KB   976/1989 KB   980/1989 KB   983/1989 KB   987/1989 KB   991/1989 KB   995/1989 KB   997/1989 KB   1001/1989 KB   1005/1989 KB   1007/1989 KB   1011/1989 KB   1015/1989 KB   1019/1989 KB   1022/1989 KB   1026/1989 KB   1030/1989 KB   1034/1989 KB   1038/1989 KB   1042/1989 KB   1046/1989 KB   1046/1989 KB   1050/1989 KB   1054/1989 KB   1058/1989 KB   1062/1989 KB   1063/1989 KB   1067/1989 KB   1071/1989 KB   1073/1989 KB   1077/1989 KB   1081/1989 KB   1085/1989 KB   1089/1989 KB   1090/1989 KB   1094/1989 KB   1098/1989 KB   1102/1989 KB   1106/1989 KB   1107/1989 KB   1110/1989 KB   1114/1989 KB   1118/1989 KB   1122/1989 KB   1126/1989 KB   1127/1989 KB   1131/1989 KB   1135/1989 KB   1139/1989 KB   1143/1989 KB   1144/1989 KB   1148/1989 KB   1152/1989 KB   1156/1989 KB   1160/1989 KB   1164/1989 KB   1168/1989 KB   1172/1989 KB   1174/1989 KB   1178/1989 KB   1182/1989 KB   1186/1989 KB   1190/1989 KB   1192/1989 KB   1196/1989 KB   1200/1989 KB   1204/1989 KB   1208/1989 KB   1212/1989 KB   1216/1989 KB   1220/1989 KB   1224/1989 KB   1228/1989 KB   1232/1989 KB   1236/1989 KB   1237/1989 KB   1241/1989 KB   1245/1989 KB   1249/1989 KB   1253/1989 KB   1257/1989 KB   1261/1989 KB   1265/1989 KB   1269/1989 KB   1273/1989 KB   1277/1989 KB   1281/1989 KB   1285/1989 KB   1289/1989 KB   1293/1989 KB   1297/1989 KB   1301/1989 KB   1301/1989 KB   1305/1989 KB   1309/1989 KB   1313/1989 KB   1317/1989 KB   1321/1989 KB   1325/1989 KB   1329/1989 KB   1333/1989 KB   1337/1989 KB   1340/1989 KB   1344/1989 KB   1348/1989 KB   1352/1989 KB   1356/1989 KB   1360/1989 KB   1364/1989 KB   1364/1989 KB   1368/1989 KB   1372/1989 KB   1376/1989 KB   1380/1989 KB   1384/1989 KB   1386/1989 KB   1390/1989 KB   1394/1989 KB   1398/1989 KB   1402/1989 KB   1406/1989 KB   1407/1989 KB   1411/1989 KB   1415/1989 KB   1419/1989 KB   1423/1989 KB   1427/1989 KB   1431/1989 KB   1435/1989 KB   1439/1989 KB   1443/1989 KB   1447/1989 KB   1449/1989 KB   1453/1989 KB   1457/1989 KB   1461/1989 KB   1465/1989 KB   1469/1989 KB   1471/1989 KB   1475/1989 KB   1479/1989 KB   1483/1989 KB   1487/1989 KB   1491/1989 KB   1492/1989 KB   1496/1989 KB   1500/1989 KB   1504/1989 KB   1508/1989 KB   1512/1989 KB   1516/1989 KB   1520/1989 KB   1524/1989 KB   1528/1989 KB   1531/1989 KB   1535/1989 KB   1539/1989 KB   1543/1989 KB   1547/1989 KB   1551/1989 KB   1555/1989 KB   1555/1989 KB   1559/1989 KB   1563/1989 KB   1567/1989 KB   1571/1989 KB   1575/1989 KB   1578/1989 KB   1582/1989 KB   1586/1989 KB   1590/1989 KB   1594/1989 KB   1598/1989 KB   1602/1989 KB   1606/1989 KB   1610/1989 KB   1614/1989 KB   1618/1989 KB   1619/1989 KB   1623/1989 KB   1627/1989 KB   1631/1989 KB   1635/1989 KB   1639/1989 KB   1643/1989 KB   1643/1989 KB   1647/1989 KB   1651/1989 KB   1655/1989 KB   1659/1989 KB   1663/1989 KB   1667/1989 KB   1667/1989 KB   1671/1989 KB   1675/1989 KB   1679/1989 KB   1683/1989 KB   1687/1989 KB   1691/1989 KB   1695/1989 KB   1699/1989 KB   1703/1989 KB   1707/1989 KB   1708/1989 KB   1712/1989 KB   1716/1989 KB   1720/1989 KB   1724/1989 KB   1728/1989 KB   1732/1989 KB   1734/1989 KB   1738/1989 KB   1742/1989 KB   1746/1989 KB   1746/1989 KB   1750/1989 KB   1754/1989 KB   1758/1989 KB   1762/1989 KB   1766/1989 KB   1770/1989 KB   1772/1989 KB   1776/1989 KB   1780/1989 KB   1784/1989 KB   1788/1989 KB   1792/1989 KB   1796/1989 KB   1797/1989 KB   1801/1989 KB   1805/1989 KB   1809/1989 KB   1810/1989 KB   1814/1989 KB   1818/1989 KB   1822/1989 KB   1826/1989 KB   1830/1989 KB   1834/1989 KB   1837/1989 KB   1841/1989 KB   1844/1989 KB   1848/1989 KB   1852/1989 KB   1856/1989 KB   1860/1989 KB   1864/1989 KB   1868/1989 KB   1872/1989 KB   1876/1989 KB   1880/1989 KB   1884/1989 KB   1888/1989 KB   1892/1989 KB   1896/1989 KB   1900/1989 KB   1900/1989 KB   1904/1989 KB   1908/1989 KB   1912/1989 KB   1916/1989 KB   1920/1989 KB   1924/1989 KB   1928/1989 KB   1932/1989 KB   1936/1989 KB   1937/1989 KB   1941/1989 KB   1945/1989 KB   1949/1989 KB   1953/1989 KB   1957/1989 KB   1961/1989 KB   1965/1989 KB   1965/1989 KB   1969/1989 KB   1973/1989 KB   1977/1989 KB   1981/1989 KB   1985/1989 KB   1989/1989 KB                  Downloaded: http://repo.maven.apache.org/maven2/org/apache/ant/ant/1.9.7/ant-1.9.7.jar (1989 KB at 9992.3 KB/sec)
[INFO]
[INFO] --- maven-clean-plugin:3.0.0:clean (default-clean) @ openjpa-lib ---
[INFO]
[INFO] --- buildnumber-maven-plugin:1.4:create (default) @ openjpa-lib ---
[INFO]
[INFO] --- maven-enforcer-plugin:1.4.1:enforce (default) @ openjpa-lib ---
[INFO]
[INFO] --- maven-checkstyle-plugin:2.9:checkstyle (default) @ openjpa-lib ---
[INFO] Starting audit...
Audit done.

[WARNING] Unable to locate Source XRef to link to - DISABLED
[ERROR] VM #image: error : too few arguments to macro. Wanted 5 got 0
[ERROR] VM #image: error : too few arguments to macro. Wanted 5 got 0
[ERROR] VM #displayTree: error : too few arguments to macro. Wanted 2 got 0
[ERROR] VM #menuItem: error : too few arguments to macro. Wanted 1 got 0
[INFO]
[INFO] --- maven-remote-resources-plugin:1.5:process (process-resource-bundles) @ openjpa-lib ---
[INFO]
[INFO] --- maven-resources-plugin:2.7:resources (default-resources) @ openjpa-lib ---
[INFO] Using 'UTF-8' encoding to copy filtered resources.
[INFO] Copying 9 resources
[INFO] Copying 3 resources
[INFO]
[INFO] --- maven-compiler-plugin:3.5.1:compile (default-compile) @ openjpa-lib ---
[INFO] Changes detected - recompiling the module!
[INFO] Compiling 161 source files to <https://builds.apache.org/job/OpenJPA-Trunk-new/ws/openjpa-lib/target/classes>
[INFO] ------------------------------------------------------------------------
[INFO] Reactor Summary:
[INFO]
[INFO] OpenJPA Parent POM ................................ SUCCESS [7.134s]
[INFO] OpenJPA Utilities Library ......................... FAILURE [3.823s]
[INFO] OpenJPA Kernel .................................... SKIPPED
[INFO] OpenJPA JDBC ...................................... SKIPPED
[INFO] OpenJPA Persistence ............................... SKIPPED
[INFO] OpenJPA Persistence JDBC .......................... SKIPPED
[INFO] OpenJPA Persistence Locking Tests ................. SKIPPED
[INFO] OpenJPA tools ..................................... SKIPPED
[INFO] OpenJPA Maven Plugin .............................. SKIPPED
[INFO] OpenJPA XML Store ................................. SKIPPED
[INFO] OpenJPA Slice ..................................... SKIPPED
[INFO] OpenJPA JEST ...................................... SKIPPED
[INFO] OpenJPA Aggregate Jar ............................. SKIPPED
[INFO] OpenJPA Aggregate Jar with Dependencies ........... SKIPPED
[INFO] OpenJPA Project Docs and Assemblies ............... SKIPPED
[INFO] OpenJPA Examples .................................. SKIPPED
[INFO] OpenJPA Examples - Simple ......................... SKIPPED
[INFO] OpenJPA Examples - image-gallery .................. SKIPPED
[INFO] OpenJPA Examples - OpenBooks ...................... SKIPPED
[INFO] OpenJPA Integration Tests ......................... SKIPPED
[INFO] OpenJPA Integration Tests - Daytrader ............. SKIPPED
[INFO] OpenJPA Integration Tests - Examples .............. SKIPPED
[INFO] OpenJPA Integration Tests - SLF4JLogFactory ....... SKIPPED
[INFO] OpenJPA Integration Tests - JPA TCK ............... SKIPPED
[INFO] OpenJPA Integration Tests - Bean Validation ....... SKIPPED
[INFO] OpenJPA Integration Tests - JMX Platform MBeans ... SKIPPED
[INFO] OpenJPA Fetching Statistic Tool ................... SKIPPED
[INFO] OpenJPA Fetching Statistic Tool -- WAS Bundle ..... SKIPPED
[INFO] OpenJPA Features .................................. SKIPPED
[INFO] ------------------------------------------------------------------------
[INFO] BUILD FAILURE
[INFO] ------------------------------------------------------------------------
[INFO] Total time: 12.725s
[INFO] Finished at: Wed Jul 26 19:01:10 UTC 2017
[INFO] Final Memory: 35M/1447M
[INFO] ------------------------------------------------------------------------
[ERROR] Failed to execute goal org.apache.maven.plugins:maven-compiler-plugin:3.5.1:compile (default-compile) on project openjpa-lib: Fatal error compiling: invalid target release: 1.8 -> [Help 1]
[ERROR]
[ERROR] To see the full stack trace of the errors, re-run Maven with the -e switch.
[ERROR] Re-run Maven using the -X switch to enable full debug logging.
[ERROR]
[ERROR] For more information about the errors and possible solutions, please read the following articles:
[ERROR] [Help 1] http://cwiki.apache.org/confluence/display/MAVEN/MojoExecutionException
[ERROR]
[ERROR] After correcting the problems, you can resume the build with the command
[ERROR]   mvn <goals> -rf :openjpa-lib
Build step 'Execute shell' marked build as failure
Archiving artifacts
Setting ANT_1_9_7_HOME=/home/jenkins/tools/ant/apache-ant-1.9.7
Setting JDK_1_7_LATEST__HOME=/home/jenkins/tools/java/latest1.7
Setting MAVEN_3_0_4_HOME=/home/jenkins/tools/maven/apache-maven-3.0.4
Recording test results
Setting ANT_1_9_7_HOME=/home/jenkins/tools/ant/apache-ant-1.9.7
Setting JDK_1_7_LATEST__HOME=/home/jenkins/tools/java/latest1.7
Setting MAVEN_3_0_4_HOME=/home/jenkins/tools/maven/apache-maven-3.0.4
ERROR: Step ?Publish JUnit test result report? failed: No test report files were found. Configuration error?
Setting ANT_1_9_7_HOME=/home/jenkins/tools/ant/apache-ant-1.9.7
Setting JDK_1_7_LATEST__HOME=/home/jenkins/tools/java/latest1.7
Setting MAVEN_3_0_4_HOME=/home/jenkins/tools/maven/apache-maven-3.0.4
Reply | Threaded
Open this post in threaded view
|  
Report Content as Inappropriate

Build failed in Jenkins: OpenJPA-trunk #4

Apache Jenkins Server-2
See <https://builds.apache.org/job/OpenJPA-trunk/4/display/redirect>

------------------------------------------
[...truncated 1.58 MB...]
Tests run: 2, Failures: 0, Errors: 0, Skipped: 0, Time elapsed: 1.454 sec - in org.apache.openjpa.persistence.proxy.TestDetachMerge
Running org.apache.openjpa.persistence.conf.TestOverrideNonJtaDataSource
Tests run: 6, Failures: 0, Errors: 0, Skipped: 0, Time elapsed: 21.322 sec - in org.apache.openjpa.persistence.conf.TestOverrideNonJtaDataSource
Running org.apache.openjpa.persistence.conf.TestSwitchConnection
Tests run: 6, Failures: 0, Errors: 0, Skipped: 0, Time elapsed: 0.665 sec - in org.apache.openjpa.persistence.conf.TestSwitchConnection
Running org.apache.openjpa.persistence.spring.TestLibService
Tests run: 4, Failures: 0, Errors: 0, Skipped: 0, Time elapsed: 14.275 sec - in org.apache.openjpa.persistence.spring.TestLibService
Running org.apache.openjpa.persistence.validation.TestValidationMode
Tests run: 8, Failures: 0, Errors: 0, Skipped: 0, Time elapsed: 0.193 sec - in org.apache.openjpa.persistence.validation.TestValidationMode
Running org.apache.openjpa.persistence.validation.TestValidationFactory
Tests run: 4, Failures: 0, Errors: 0, Skipped: 0, Time elapsed: 0.028 sec - in org.apache.openjpa.persistence.validation.TestValidationFactory
Running org.apache.openjpa.persistence.lifecycle.TestPessimisticPNonTransToPDirty
Tests run: 1, Failures: 0, Errors: 0, Skipped: 0, Time elapsed: 0.913 sec - in org.apache.openjpa.persistence.lifecycle.TestPessimisticPNonTransToPDirty
Running org.apache.openjpa.persistence.lifecycle.TestMergeAndPersistWithManagedRelation
Tests run: 2, Failures: 0, Errors: 0, Skipped: 0, Time elapsed: 0.554 sec - in org.apache.openjpa.persistence.lifecycle.TestMergeAndPersistWithManagedRelation
Running org.apache.openjpa.persistence.query.TestSimple
Tests run: 1, Failures: 0, Errors: 0, Skipped: 0, Time elapsed: 10.73 sec - in org.apache.openjpa.persistence.query.TestSimple
Running org.apache.openjpa.persistence.query.TestNamedQueries
Tests run: 4, Failures: 0, Errors: 0, Skipped: 0, Time elapsed: 0.863 sec - in org.apache.openjpa.persistence.query.TestNamedQueries
Running org.apache.openjpa.persistence.query.Test1x1OrderByResultCollection
Tests run: 3, Failures: 0, Errors: 0, Skipped: 0, Time elapsed: 8.152 sec - in org.apache.openjpa.persistence.query.Test1x1OrderByResultCollection
Running org.apache.openjpa.persistence.query.TestDistinctQueries
Tests run: 5, Failures: 0, Errors: 0, Skipped: 0, Time elapsed: 0.971 sec - in org.apache.openjpa.persistence.query.TestDistinctQueries
Running org.apache.openjpa.persistence.query.TestAbstractSchemaName
Tests run: 1, Failures: 0, Errors: 0, Skipped: 0, Time elapsed: 0.09 sec - in org.apache.openjpa.persistence.query.TestAbstractSchemaName
Running org.apache.openjpa.persistence.query.results.TestListResultSerialization
Tests run: 1, Failures: 0, Errors: 0, Skipped: 0, Time elapsed: 0.01 sec - in org.apache.openjpa.persistence.query.results.TestListResultSerialization
Running org.apache.openjpa.persistence.query.results.TestResultSetMapping
Tests run: 1, Failures: 0, Errors: 0, Skipped: 0, Time elapsed: 0.263 sec - in org.apache.openjpa.persistence.query.results.TestResultSetMapping
Running org.apache.openjpa.persistence.query.results.TestJPQLMultiSelectTypedResults
Tests run: 3, Failures: 0, Errors: 0, Skipped: 0, Time elapsed: 1.188 sec - in org.apache.openjpa.persistence.query.results.TestJPQLMultiSelectTypedResults
Running org.apache.openjpa.persistence.query.TestInMemoryQueryMatchEscapes
Tests run: 2, Failures: 0, Errors: 0, Skipped: 0, Time elapsed: 0.082 sec - in org.apache.openjpa.persistence.query.TestInMemoryQueryMatchEscapes
Running org.apache.openjpa.persistence.query.TestQueryPagination
Tests run: 6, Failures: 0, Errors: 0, Skipped: 0, Time elapsed: 0.299 sec - in org.apache.openjpa.persistence.query.TestQueryPagination
Running org.apache.openjpa.persistence.query.TestDataStoreActions
Tests run: 1, Failures: 0, Errors: 0, Skipped: 0, Time elapsed: 0.031 sec - in org.apache.openjpa.persistence.query.TestDataStoreActions
Running org.apache.openjpa.persistence.query.TestDupNamedQuery
Tests run: 1, Failures: 0, Errors: 0, Skipped: 0, Time elapsed: 0.092 sec - in org.apache.openjpa.persistence.query.TestDupNamedQuery
Running org.apache.openjpa.persistence.query.TestWildCardCount
Tests run: 3, Failures: 0, Errors: 0, Skipped: 0, Time elapsed: 0.059 sec - in org.apache.openjpa.persistence.query.TestWildCardCount
Running org.apache.openjpa.persistence.query.TestJPQLWithoutIdentificationVariable
Tests run: 1, Failures: 0, Errors: 0, Skipped: 0, Time elapsed: 0.035 sec - in org.apache.openjpa.persistence.query.TestJPQLWithoutIdentificationVariable
Running org.apache.openjpa.persistence.query.TestEscapedSingleQuotesInJPQL
Tests run: 1, Failures: 0, Errors: 0, Skipped: 0, Time elapsed: 0.161 sec - in org.apache.openjpa.persistence.query.TestEscapedSingleQuotesInJPQL
Running org.apache.openjpa.persistence.query.TestNewlinesInQueries
Tests run: 1, Failures: 0, Errors: 0, Skipped: 0, Time elapsed: 0.049 sec - in org.apache.openjpa.persistence.query.TestNewlinesInQueries
Running org.apache.openjpa.persistence.query.TestComplexQueries
Tests run: 13, Failures: 0, Errors: 0, Skipped: 0, Time elapsed: 4.382 sec - in org.apache.openjpa.persistence.query.TestComplexQueries
Running org.apache.openjpa.persistence.query.TestJDBCEscapeDate
Tests run: 2, Failures: 0, Errors: 0, Skipped: 0, Time elapsed: 1.617 sec - in org.apache.openjpa.persistence.query.TestJDBCEscapeDate
Running org.apache.openjpa.persistence.query.sqlresultmapping.TestSQLResultSetMapping
Tests run: 2, Failures: 0, Errors: 0, Skipped: 0, Time elapsed: 2.65 sec - in org.apache.openjpa.persistence.query.sqlresultmapping.TestSQLResultSetMapping
Running org.apache.openjpa.persistence.query.TestQueryParameters
Tests run: 20, Failures: 0, Errors: 0, Skipped: 0, Time elapsed: 0.063 sec - in org.apache.openjpa.persistence.query.TestQueryParameters
Running org.apache.openjpa.persistence.query.TestEJBQueryInterface
Tests run: 7, Failures: 0, Errors: 0, Skipped: 0, Time elapsed: 2.336 sec - in org.apache.openjpa.persistence.query.TestEJBQueryInterface
Running org.apache.openjpa.persistence.query.TestQueryResults
Tests run: 24, Failures: 0, Errors: 0, Skipped: 0, Time elapsed: 6.419 sec - in org.apache.openjpa.persistence.query.TestQueryResults
Running org.apache.openjpa.persistence.query.TestQueryExpressionSplit
Tests run: 4, Failures: 0, Errors: 0, Skipped: 0, Time elapsed: 0.001 sec - in org.apache.openjpa.persistence.query.TestQueryExpressionSplit
Running org.apache.openjpa.persistence.query.TestJPAQuerySubclassFunc
Tests run: 2, Failures: 0, Errors: 0, Skipped: 0, Time elapsed: 0.408 sec - in org.apache.openjpa.persistence.query.TestJPAQuerySubclassFunc
Running org.apache.openjpa.persistence.query.TestLocate
Tests run: 2, Failures: 0, Errors: 0, Skipped: 0, Time elapsed: 0.327 sec - in org.apache.openjpa.persistence.query.TestLocate
Running org.apache.openjpa.persistence.query.TestTimeoutException
Tests run: 3, Failures: 0, Errors: 0, Skipped: 0, Time elapsed: 30.223 sec - in org.apache.openjpa.persistence.query.TestTimeoutException
Running org.apache.openjpa.persistence.query.TestAccessPathsOfSubqueries
Tests run: 2, Failures: 0, Errors: 0, Skipped: 0, Time elapsed: 0.202 sec - in org.apache.openjpa.persistence.query.TestAccessPathsOfSubqueries
Running org.apache.openjpa.persistence.query.TestQueryResultClassAPI
Tests run: 1, Failures: 0, Errors: 0, Skipped: 0, Time elapsed: 0.13 sec - in org.apache.openjpa.persistence.query.TestQueryResultClassAPI
Running org.apache.openjpa.persistence.query.TestResultSetMapping
Tests run: 1, Failures: 0, Errors: 0, Skipped: 0, Time elapsed: 0.066 sec - in org.apache.openjpa.persistence.query.TestResultSetMapping
Running org.apache.openjpa.persistence.query.TestMathQueries
Tests run: 1, Failures: 0, Errors: 0, Skipped: 0, Time elapsed: 0.286 sec - in org.apache.openjpa.persistence.query.TestMathQueries
Running org.apache.openjpa.persistence.query.TestQueryTimeout
Tests run: 12, Failures: 0, Errors: 0, Skipped: 0, Time elapsed: 50.396 sec - in org.apache.openjpa.persistence.query.TestQueryTimeout
Running org.apache.openjpa.persistence.query.TestEJBPolymorphicQuery
Tests run: 2, Failures: 0, Errors: 0, Skipped: 0, Time elapsed: 0.629 sec - in org.apache.openjpa.persistence.query.TestEJBPolymorphicQuery
Running org.apache.openjpa.persistence.query.TestDoubleQuotedStringLiteralInJPQL
Tests run: 1, Failures: 0, Errors: 0, Skipped: 0, Time elapsed: 0.409 sec - in org.apache.openjpa.persistence.query.TestDoubleQuotedStringLiteralInJPQL
Running org.apache.openjpa.persistence.query.TestQueryConvertPositionalParameters
Tests run: 5, Failures: 0, Errors: 0, Skipped: 0, Time elapsed: 0.566 sec - in org.apache.openjpa.persistence.query.TestQueryConvertPositionalParameters
Running org.apache.openjpa.persistence.query.TestEJBDeleteUpdateImpl
Tests run: 5, Failures: 0, Errors: 0, Skipped: 0, Time elapsed: 1.241 sec - in org.apache.openjpa.persistence.query.TestEJBDeleteUpdateImpl
Running org.apache.openjpa.persistence.query.TestNewEntityAsQueryParameter
Tests run: 3, Failures: 0, Errors: 0, Skipped: 0, Time elapsed: 2.244 sec - in org.apache.openjpa.persistence.query.TestNewEntityAsQueryParameter
Running org.apache.openjpa.persistence.query.TestQueryExcludingSubclasses
Tests run: 2, Failures: 0, Errors: 0, Skipped: 0, Time elapsed: 0.469 sec - in org.apache.openjpa.persistence.query.TestQueryExcludingSubclasses
Running org.apache.openjpa.persistence.query.TestQueryLock
Tests run: 3, Failures: 0, Errors: 0, Skipped: 0, Time elapsed: 0.255 sec - in org.apache.openjpa.persistence.query.TestQueryLock
Running org.apache.openjpa.persistence.query.TestQueryIdOfRelationDoesNotJoin
Tests run: 1, Failures: 0, Errors: 0, Skipped: 0, Time elapsed: 0.22 sec - in org.apache.openjpa.persistence.query.TestQueryIdOfRelationDoesNotJoin
Running org.apache.openjpa.persistence.query.TestMethodQLQuery
Tests run: 4, Failures: 0, Errors: 0, Skipped: 0, Time elapsed: 0.047 sec - in org.apache.openjpa.persistence.query.TestMethodQLQuery
Running org.apache.openjpa.persistence.query.TestSubstring
Tests run: 5, Failures: 0, Errors: 0, Skipped: 0, Time elapsed: 0.879 sec - in org.apache.openjpa.persistence.query.TestSubstring
Running org.apache.openjpa.persistence.query.TestQueryEscapeCharacters
Tests run: 7, Failures: 0, Errors: 0, Skipped: 0, Time elapsed: 0.665 sec - in org.apache.openjpa.persistence.query.TestQueryEscapeCharacters
Running org.apache.openjpa.persistence.query.TestProjectionQueryWithIdenticalResult
Tests run: 4, Failures: 0, Errors: 0, Skipped: 0, Time elapsed: 1.272 sec - in org.apache.openjpa.persistence.query.TestProjectionQueryWithIdenticalResult
Running org.apache.openjpa.persistence.query.TestOutOfBoundsEx
Tests run: 1, Failures: 0, Errors: 0, Skipped: 0, Time elapsed: 4.332 sec - in org.apache.openjpa.persistence.query.TestOutOfBoundsEx
Running org.apache.openjpa.persistence.query.TestSubquery
Tests run: 4, Failures: 0, Errors: 0, Skipped: 0, Time elapsed: 24.708 sec - in org.apache.openjpa.persistence.query.TestSubquery
Running org.apache.openjpa.persistence.util.TestProviderUtil
Tests run: 6, Failures: 0, Errors: 0, Skipped: 0, Time elapsed: 2.528 sec - in org.apache.openjpa.persistence.util.TestProviderUtil
Running org.apache.openjpa.persistence.util.TestPersistenceUnitUtil
Tests run: 10, Failures: 0, Errors: 0, Skipped: 0, Time elapsed: 5.052 sec - in org.apache.openjpa.persistence.util.TestPersistenceUnitUtil
Running org.apache.openjpa.persistence.util.TestPersistenceUtil
Tests run: 6, Failures: 0, Errors: 0, Skipped: 0, Time elapsed: 0.662 sec - in org.apache.openjpa.persistence.util.TestPersistenceUtil
Running org.apache.openjpa.persistence.util.TestJPAFacadeHelper
Tests run: 15, Failures: 0, Errors: 0, Skipped: 0, Time elapsed: 4.179 sec - in org.apache.openjpa.persistence.util.TestJPAFacadeHelper
Running org.apache.openjpa.persistence.external.TestExternalValues
Tests run: 2, Failures: 0, Errors: 0, Skipped: 0, Time elapsed: 1.368 sec - in org.apache.openjpa.persistence.external.TestExternalValues
Running org.apache.openjpa.persistence.querycache.TestQueryCacheWithDataCache
Tests run: 1, Failures: 0, Errors: 0, Skipped: 0, Time elapsed: 1.009 sec - in org.apache.openjpa.persistence.querycache.TestQueryCacheWithDataCache
Running org.apache.openjpa.persistence.querycache.TestQuerySQLCache
Tests run: 4, Failures: 0, Errors: 0, Skipped: 0, Time elapsed: 2.815 sec - in org.apache.openjpa.persistence.querycache.TestQuerySQLCache
Running org.apache.openjpa.persistence.detach.TestDetachStateCascade
Tests run: 3, Failures: 0, Errors: 0, Skipped: 0, Time elapsed: 3.249 sec - in org.apache.openjpa.persistence.detach.TestDetachStateCascade
Running org.apache.openjpa.persistence.detach.TestDetachCascade
Tests run: 9, Failures: 0, Errors: 0, Skipped: 0, Time elapsed: 7.875 sec - in org.apache.openjpa.persistence.detach.TestDetachCascade
Running org.apache.openjpa.persistence.detach.TestDetachNoProxy
Tests run: 6, Failures: 0, Errors: 0, Skipped: 0, Time elapsed: 2.741 sec - in org.apache.openjpa.persistence.detach.TestDetachNoProxy
Running org.apache.openjpa.persistence.detach.TestDetachReloadProp
Tests run: 2, Failures: 0, Errors: 0, Skipped: 0, Time elapsed: 2.873 sec - in org.apache.openjpa.persistence.detach.TestDetachReloadProp
Running org.apache.openjpa.persistence.detach.TestMergeNoStateManager
Tests run: 1, Failures: 0, Errors: 0, Skipped: 0, Time elapsed: 0.406 sec - in org.apache.openjpa.persistence.detach.TestMergeNoStateManager
Running org.apache.openjpa.persistence.detach.serializable.TestSerializableDetachedStateManager
Tests run: 1, Failures: 0, Errors: 0, Skipped: 0, Time elapsed: 0.377 sec - in org.apache.openjpa.persistence.detach.serializable.TestSerializableDetachedStateManager
Running org.apache.openjpa.persistence.detach.TestDetachNoCascade
Tests run: 12, Failures: 0, Errors: 0, Skipped: 0, Time elapsed: 0.865 sec - in org.apache.openjpa.persistence.detach.TestDetachNoCascade
Running org.apache.openjpa.persistence.detach.xml.TestDetachXML
Tests run: 3, Failures: 0, Errors: 0, Skipped: 0, Time elapsed: 18.267 sec - in org.apache.openjpa.persistence.detach.xml.TestDetachXML
Running org.apache.openjpa.persistence.TestXMLPersistenceMetaDataParser
Tests run: 3, Failures: 0, Errors: 0, Skipped: 0, Time elapsed: 0.24 sec - in org.apache.openjpa.persistence.TestXMLPersistenceMetaDataParser
Running org.apache.openjpa.persistence.TestOpenjpaIdNotRecognizedMessage
Tests run: 1, Failures: 0, Errors: 0, Skipped: 0, Time elapsed: 0.3 sec - in org.apache.openjpa.persistence.TestOpenjpaIdNotRecognizedMessage
Running org.apache.openjpa.enhance.ids.TestOptimizeIdCopy
Tests run: 3, Failures: 0, Errors: 0, Skipped: 0, Time elapsed: 1.108 sec - in org.apache.openjpa.enhance.ids.TestOptimizeIdCopy
Running org.apache.openjpa.enhance.TestPCEnhancerEnhancementContractVersion
Tests run: 3, Failures: 0, Errors: 0, Skipped: 0, Time elapsed: 0.001 sec - in org.apache.openjpa.enhance.TestPCEnhancerEnhancementContractVersion
Running org.apache.openjpa.enhance.TestSimpleUnenhancedQuery
Tests run: 1, Failures: 0, Errors: 0, Skipped: 0, Time elapsed: 0.78 sec - in org.apache.openjpa.enhance.TestSimpleUnenhancedQuery
Running org.apache.openjpa.enhance.TestEnhancementWithMultiplePUs
Tests run: 3, Failures: 0, Errors: 0, Skipped: 0, Time elapsed: 38.102 sec - in org.apache.openjpa.enhance.TestEnhancementWithMultiplePUs
Running org.apache.openjpa.enhance.TestClassHierarchyEnhancement
Tests run: 1, Failures: 0, Errors: 0, Skipped: 0, Time elapsed: 0.005 sec - in org.apache.openjpa.enhance.TestClassHierarchyEnhancement
Running org.apache.openjpa.enhance.TestDataCachingAndUnenhancedPropertyAccess
Tests run: 2, Failures: 0, Errors: 0, Skipped: 0, Time elapsed: 1.267 sec - in org.apache.openjpa.enhance.TestDataCachingAndUnenhancedPropertyAccess
Running org.apache.openjpa.enhance.TestPCEnhancerFindField
Tests run: 1, Failures: 0, Errors: 0, Skipped: 0, Time elapsed: 0.014 sec - in org.apache.openjpa.enhance.TestPCEnhancerFindField
Running org.apache.openjpa.conf.TestSpecificationConfiguration
Tests run: 9, Failures: 0, Errors: 0, Skipped: 0, Time elapsed: 0.084 sec - in org.apache.openjpa.conf.TestSpecificationConfiguration
Running org.apache.openjpa.conf.TestQueryHints
Tests run: 17, Failures: 0, Errors: 0, Skipped: 0, Time elapsed: 0.114 sec - in org.apache.openjpa.conf.TestQueryHints
Running org.apache.openjpa.conf.TestAutoDetachProperty
Tests run: 3, Failures: 0, Errors: 0, Skipped: 0, Time elapsed: 0.017 sec - in org.apache.openjpa.conf.TestAutoDetachProperty
Running org.apache.openjpa.conf.TestCacheMarshaller
Tests run: 5, Failures: 0, Errors: 0, Skipped: 0, Time elapsed: 0.037 sec - in org.apache.openjpa.conf.TestCacheMarshaller
Running org.apache.openjpa.conf.TestCacheMarshallerEndToEnd
Tests run: 1, Failures: 0, Errors: 0, Skipped: 0, Time elapsed: 1.729 sec - in org.apache.openjpa.conf.TestCacheMarshallerEndToEnd
Running org.apache.openjpa.conf.TestDynamicConfiguration
Tests run: 7, Failures: 0, Errors: 0, Skipped: 0, Time elapsed: 0.082 sec - in org.apache.openjpa.conf.TestDynamicConfiguration
Running org.apache.openjpa.conf.TestGetProperty
Tests run: 1, Failures: 0, Errors: 0, Skipped: 0, Time elapsed: 0.243 sec - in org.apache.openjpa.conf.TestGetProperty
Running org.apache.openjpa.conf.TestBadAutoDetachProperty
Tests run: 3, Failures: 0, Errors: 0, Skipped: 0, Time elapsed: 0.02 sec - in org.apache.openjpa.conf.TestBadAutoDetachProperty
Running org.apache.openjpa.conf.TestBadJdbcUrl
Tests run: 5, Failures: 0, Errors: 0, Skipped: 0, Time elapsed: 0.031 sec - in org.apache.openjpa.conf.TestBadJdbcUrl
Running org.apache.openjpa.conf.TestQueryProperties
Tests run: 2, Failures: 0, Errors: 0, Skipped: 0, Time elapsed: 0.034 sec - in org.apache.openjpa.conf.TestQueryProperties
Running org.apache.openjpa.lib.conf.TestEquivalentConfiguration
Tests run: 12, Failures: 0, Errors: 0, Skipped: 0, Time elapsed: 7.149 sec - in org.apache.openjpa.lib.conf.TestEquivalentConfiguration
Running org.apache.openjpa.lib.conf.TestAnchorParsing
Tests run: 7, Failures: 0, Errors: 0, Skipped: 0, Time elapsed: 0.016 sec - in org.apache.openjpa.lib.conf.TestAnchorParsing

Results :

Tests in error:
  TestMappingToolRefresh>AbstractPersistenceTestCase.run:206->AbstractPersistenceTestCase.runBare:541->AbstractPersistenceTestCase.runBare:565->AbstractPersistenceTestCase.runTest:578->testSchemaCreation:99 » Runtime

Tests run: 3106, Failures: 0, Errors: 1, Skipped: 0

[INFO] ------------------------------------------------------------------------
[INFO] Reactor Summary:
[INFO]
[INFO] OpenJPA Parent POM ................................ SUCCESS [6.502s]
[INFO] OpenJPA Utilities Library ......................... SUCCESS [9.337s]
[INFO] OpenJPA Kernel .................................... SUCCESS [8.202s]
[INFO] OpenJPA JDBC ...................................... SUCCESS [6.165s]
[INFO] OpenJPA Persistence ............................... SUCCESS [4.343s]
[INFO] OpenJPA Persistence JDBC .......................... FAILURE [29:25.899s]
[INFO] OpenJPA Persistence Locking Tests ................. SKIPPED
[INFO] OpenJPA tools ..................................... SKIPPED
[INFO] OpenJPA Maven Plugin .............................. SKIPPED
[INFO] OpenJPA XML Store ................................. SKIPPED
[INFO] OpenJPA Slice ..................................... SKIPPED
[INFO] OpenJPA JEST ...................................... SKIPPED
[INFO] OpenJPA Aggregate Jar ............................. SKIPPED
[INFO] OpenJPA Aggregate Jar with Dependencies ........... SKIPPED
[INFO] OpenJPA Project Docs and Assemblies ............... SKIPPED
[INFO] OpenJPA Examples .................................. SKIPPED
[INFO] OpenJPA Examples - Simple ......................... SKIPPED
[INFO] OpenJPA Examples - image-gallery .................. SKIPPED
[INFO] OpenJPA Examples - OpenBooks ...................... SKIPPED
[INFO] OpenJPA Integration Tests ......................... SKIPPED
[INFO] OpenJPA Integration Tests - Daytrader ............. SKIPPED
[INFO] OpenJPA Integration Tests - Examples .............. SKIPPED
[INFO] OpenJPA Integration Tests - SLF4JLogFactory ....... SKIPPED
[INFO] OpenJPA Integration Tests - JPA TCK ............... SKIPPED
[INFO] OpenJPA Integration Tests - Bean Validation ....... SKIPPED
[INFO] OpenJPA Integration Tests - JMX Platform MBeans ... SKIPPED
[INFO] OpenJPA Fetching Statistic Tool ................... SKIPPED
[INFO] OpenJPA Fetching Statistic Tool -- WAS Bundle ..... SKIPPED
[INFO] OpenJPA Features .................................. SKIPPED
[INFO] ------------------------------------------------------------------------
[INFO] BUILD FAILURE
[INFO] ------------------------------------------------------------------------
[INFO] Total time: 30:01.271s
[INFO] Finished at: Wed Jul 26 20:13:10 UTC 2017
[INFO] Final Memory: 132M/3807M
[INFO] ------------------------------------------------------------------------
[ERROR] Failed to execute goal org.apache.maven.plugins:maven-surefire-plugin:2.19.1:test (default-test) on project openjpa-persistence-jdbc: There are test failures.
[ERROR]
[ERROR] Please refer to <https://builds.apache.org/job/OpenJPA-trunk/ws/openjpa-persistence-jdbc/target/surefire-reports> for the individual test results.
[ERROR] -> [Help 1]
[ERROR]
[ERROR] To see the full stack trace of the errors, re-run Maven with the -e switch.
[ERROR] Re-run Maven using the -X switch to enable full debug logging.
[ERROR]
[ERROR] For more information about the errors and possible solutions, please read the following articles:
[ERROR] [Help 1] http://cwiki.apache.org/confluence/display/MAVEN/MojoFailureException
[ERROR]
[ERROR] After correcting the problems, you can resume the build with the command
[ERROR]   mvn <goals> -rf :openjpa-persistence-jdbc
Build step 'Execute shell' marked build as failure
Archiving artifacts
Setting ANT_1_9_7_HOME=/home/jenkins/tools/ant/apache-ant-1.9.7
Setting MAVEN_3_0_4_HOME=/home/jenkins/tools/maven/apache-maven-3.0.4
Setting JDK_1_8_LATEST__HOME=/home/jenkins/tools/java/latest1.8
Recording test results
Setting ANT_1_9_7_HOME=/home/jenkins/tools/ant/apache-ant-1.9.7
Setting MAVEN_3_0_4_HOME=/home/jenkins/tools/maven/apache-maven-3.0.4
Setting JDK_1_8_LATEST__HOME=/home/jenkins/tools/java/latest1.8
Setting ANT_1_9_7_HOME=/home/jenkins/tools/ant/apache-ant-1.9.7
Setting MAVEN_3_0_4_HOME=/home/jenkins/tools/maven/apache-maven-3.0.4
Setting JDK_1_8_LATEST__HOME=/home/jenkins/tools/java/latest1.8
Reply | Threaded
Open this post in threaded view
|  
Report Content as Inappropriate

Build failed in Jenkins: OpenJPA-trunk #5

Apache Jenkins Server-2
See <https://builds.apache.org/job/OpenJPA-trunk/5/display/redirect>

------------------------------------------
[...truncated 591.85 KB...]
AU        openjpa-persistence/src/main/java/org/apache/openjpa/persistence/AutoDetachType.java
A         openjpa-persistence/src/main/java/org/apache/openjpa/persistence/query
AU        openjpa-persistence/src/main/java/org/apache/openjpa/persistence/query/OrderBy.java
AU        openjpa-persistence/src/main/java/org/apache/openjpa/persistence/query/AbstractVisitable.java
AU        openjpa-persistence/src/main/java/org/apache/openjpa/persistence/query/CountExpression.java
AU        openjpa-persistence/src/main/java/org/apache/openjpa/persistence/query/ElseExpression.java
AU        openjpa-persistence/src/main/java/org/apache/openjpa/persistence/query/ConstantExpression.java
AU        openjpa-persistence/src/main/java/org/apache/openjpa/persistence/query/UnaryOperator.java
AU        openjpa-persistence/src/main/java/org/apache/openjpa/persistence/query/MinusExpression.java
AU        openjpa-persistence/src/main/java/org/apache/openjpa/persistence/query/RangeExpression.java
AU        openjpa-persistence/src/main/java/org/apache/openjpa/persistence/query/LiteralExpression.java
AU        openjpa-persistence/src/main/java/org/apache/openjpa/persistence/query/JoinPath.java
AU        openjpa-persistence/src/main/java/org/apache/openjpa/persistence/query/PathExpression.java
AU        openjpa-persistence/src/main/java/org/apache/openjpa/persistence/query/CaseExpressionImpl.java
AU        openjpa-persistence/src/main/java/org/apache/openjpa/persistence/query/QueryDefinition.java
AU        openjpa-persistence/src/main/java/org/apache/openjpa/persistence/query/DividedByExpression.java
AU        openjpa-persistence/src/main/java/org/apache/openjpa/persistence/query/GreaterThanExpression.java
AU        openjpa-persistence/src/main/java/org/apache/openjpa/persistence/query/VarArgsExpression.java
AU        openjpa-persistence/src/main/java/org/apache/openjpa/persistence/query/AbsExpression.java
AU        openjpa-persistence/src/main/java/org/apache/openjpa/persistence/query/InExpression.java
AU        openjpa-persistence/src/main/java/org/apache/openjpa/persistence/query/LogicalPredicate.java
AU        openjpa-persistence/src/main/java/org/apache/openjpa/persistence/query/CaseExpression.java
AU        openjpa-persistence/src/main/java/org/apache/openjpa/persistence/query/TrimExpression.java
AU        openjpa-persistence/src/main/java/org/apache/openjpa/persistence/query/AliasContext.java
AU        openjpa-persistence/src/main/java/org/apache/openjpa/persistence/query/UnaryConditionalOperator.java
AU        openjpa-persistence/src/main/java/org/apache/openjpa/persistence/query/WhenClause.java
AU        openjpa-persistence/src/main/java/org/apache/openjpa/persistence/query/Predicate.java
AU        openjpa-persistence/src/main/java/org/apache/openjpa/persistence/query/PlusExpression.java
AU        openjpa-persistence/src/main/java/org/apache/openjpa/persistence/query/KeyExpression.java
AU        openjpa-persistence/src/main/java/org/apache/openjpa/persistence/query/OperatorPath.java
AU        openjpa-persistence/src/main/java/org/apache/openjpa/persistence/query/NotEqualExpression.java
AU        openjpa-persistence/src/main/java/org/apache/openjpa/persistence/query/PathOperator.java
AU        openjpa-persistence/src/main/java/org/apache/openjpa/persistence/query/IsEmptyExpression.java
AU        openjpa-persistence/src/main/java/org/apache/openjpa/persistence/query/UpperExpression.java
AU        openjpa-persistence/src/main/java/org/apache/openjpa/persistence/query/NewInstance.java
AU        openjpa-persistence/src/main/java/org/apache/openjpa/persistence/query/ConditionalOperator.java
AU        openjpa-persistence/src/main/java/org/apache/openjpa/persistence/query/AbstractPath.java
AU        openjpa-persistence/src/main/java/org/apache/openjpa/persistence/query/BinaryOperatorExpression.java
AU        openjpa-persistence/src/main/java/org/apache/openjpa/persistence/query/Visitable.java
AU        openjpa-persistence/src/main/java/org/apache/openjpa/persistence/query/SumExpression.java
AU        openjpa-persistence/src/main/java/org/apache/openjpa/persistence/query/SquareRootExpression.java
AU        openjpa-persistence/src/main/java/org/apache/openjpa/persistence/query/QueryExpression.java
AU        openjpa-persistence/src/main/java/org/apache/openjpa/persistence/query/BinaryExpressionPredicate.java
AU        openjpa-persistence/src/main/java/org/apache/openjpa/persistence/query/IsNullExpression.java
AU        openjpa-persistence/src/main/java/org/apache/openjpa/persistence/query/EqualExpression.java
AU        openjpa-persistence/src/main/java/org/apache/openjpa/persistence/query/OpenJPAQueryBuilder.java
AU        openjpa-persistence/src/main/java/org/apache/openjpa/persistence/query/SizeExpression.java
AU        openjpa-persistence/src/main/java/org/apache/openjpa/persistence/query/UnaryOperatorExpression.java
AU        openjpa-persistence/src/main/java/org/apache/openjpa/persistence/query/QueryBuilderImpl.java
AU        openjpa-persistence/src/main/java/org/apache/openjpa/persistence/query/LengthExpression.java
AU        openjpa-persistence/src/main/java/org/apache/openjpa/persistence/query/DistinctExpression.java
AU        openjpa-persistence/src/main/java/org/apache/openjpa/persistence/query/OrPredicate.java
AU        openjpa-persistence/src/main/java/org/apache/openjpa/persistence/query/MinExpression.java
AU        openjpa-persistence/src/main/java/org/apache/openjpa/persistence/query/PredicateOperand.java
AU        openjpa-persistence/src/main/java/org/apache/openjpa/persistence/query/MemberOfExpression.java
AU        openjpa-persistence/src/main/java/org/apache/openjpa/persistence/query/QueryBuilder.java
AU        openjpa-persistence/src/main/java/org/apache/openjpa/persistence/query/OrderableItem.java
AU        openjpa-persistence/src/main/java/org/apache/openjpa/persistence/query/Subquery.java
AU        openjpa-persistence/src/main/java/org/apache/openjpa/persistence/query/ExpressionImpl.java
AU        openjpa-persistence/src/main/java/org/apache/openjpa/persistence/query/EntryExpression.java
AU        openjpa-persistence/src/main/java/org/apache/openjpa/persistence/query/AbstractDomainObject.java
AU        openjpa-persistence/src/main/java/org/apache/openjpa/persistence/query/AndPredicate.java
AU        openjpa-persistence/src/main/java/org/apache/openjpa/persistence/query/BinaryConditionalOperator.java
AU        openjpa-persistence/src/main/java/org/apache/openjpa/persistence/query/TrimSpec.java
AU        openjpa-persistence/src/main/java/org/apache/openjpa/persistence/query/LocateExpression.java
AU        openjpa-persistence/src/main/java/org/apache/openjpa/persistence/query/IndexExpression.java
AU        openjpa-persistence/src/main/java/org/apache/openjpa/persistence/query/ValueExpression.java
AU        openjpa-persistence/src/main/java/org/apache/openjpa/persistence/query/Expression.java
AU        openjpa-persistence/src/main/java/org/apache/openjpa/persistence/query/ExistsExpression.java
AU        openjpa-persistence/src/main/java/org/apache/openjpa/persistence/query/RootPath.java
AU        openjpa-persistence/src/main/java/org/apache/openjpa/persistence/query/FetchJoinObject.java
AU        openjpa-persistence/src/main/java/org/apache/openjpa/persistence/query/GreaterEqualExpression.java
AU        openjpa-persistence/src/main/java/org/apache/openjpa/persistence/query/LikeExpression.java
AU        openjpa-persistence/src/main/java/org/apache/openjpa/persistence/query/JPQLHelper.java
AU        openjpa-persistence/src/main/java/org/apache/openjpa/persistence/query/FetchPath.java
AU        openjpa-persistence/src/main/java/org/apache/openjpa/persistence/query/AnyExpression.java
AU        openjpa-persistence/src/main/java/org/apache/openjpa/persistence/query/LowerExpression.java
AU        openjpa-persistence/src/main/java/org/apache/openjpa/persistence/query/BetweenExpression.java
AU        openjpa-persistence/src/main/java/org/apache/openjpa/persistence/query/NavigationPath.java
AU        openjpa-persistence/src/main/java/org/apache/openjpa/persistence/query/package.html
AU        openjpa-persistence/src/main/java/org/apache/openjpa/persistence/query/LessEqualExpression.java
AU        openjpa-persistence/src/main/java/org/apache/openjpa/persistence/query/CurrentTimeExpression.java
AU        openjpa-persistence/src/main/java/org/apache/openjpa/persistence/query/SomeExpression.java
AU        openjpa-persistence/src/main/java/org/apache/openjpa/persistence/query/BinaryFunctionalOperator.java
AU        openjpa-persistence/src/main/java/org/apache/openjpa/persistence/query/OrderByItem.java
AU        openjpa-persistence/src/main/java/org/apache/openjpa/persistence/query/Aggregate.java
AU        openjpa-persistence/src/main/java/org/apache/openjpa/persistence/query/ConcatExpression.java
AU        openjpa-persistence/src/main/java/org/apache/openjpa/persistence/query/AllExpression.java
AU        openjpa-persistence/src/main/java/org/apache/openjpa/persistence/query/AverageExpression.java
AU        openjpa-persistence/src/main/java/org/apache/openjpa/persistence/query/UnaryMinusExpression.java
AU        openjpa-persistence/src/main/java/org/apache/openjpa/persistence/query/UnaryFunctionalOperator.java
AU        openjpa-persistence/src/main/java/org/apache/openjpa/persistence/query/ArrayExpression.java
AU        openjpa-persistence/src/main/java/org/apache/openjpa/persistence/query/DomainObject.java
AU        openjpa-persistence/src/main/java/org/apache/openjpa/persistence/query/SelectItem.java
AU        openjpa-persistence/src/main/java/org/apache/openjpa/persistence/query/ModExpression.java
AU        openjpa-persistence/src/main/java/org/apache/openjpa/persistence/query/UnaryExpressionPredicate.java
AU        openjpa-persistence/src/main/java/org/apache/openjpa/persistence/query/ParameterExpression.java
AU        openjpa-persistence/src/main/java/org/apache/openjpa/persistence/query/QueryDefinitionImpl.java
AU        openjpa-persistence/src/main/java/org/apache/openjpa/persistence/query/SubStringExpression.java
AU        openjpa-persistence/src/main/java/org/apache/openjpa/persistence/query/TimesExpression.java
AU        openjpa-persistence/src/main/java/org/apache/openjpa/persistence/query/LessThanExpression.java
AU        openjpa-persistence/src/main/java/org/apache/openjpa/persistence/query/TypeExpression.java
AU        openjpa-persistence/src/main/java/org/apache/openjpa/persistence/query/MaxExpression.java
AU        openjpa-persistence/src/main/java/org/apache/openjpa/persistence/RestoreStateType.java
AU        openjpa-persistence/src/main/java/org/apache/openjpa/persistence/FetchPlanImpl.java
AU        openjpa-persistence/src/main/java/org/apache/openjpa/persistence/JPAProperties.java
AU        openjpa-persistence/src/main/java/org/apache/openjpa/persistence/FetchGroups.java
AU        openjpa-persistence/src/main/java/org/apache/openjpa/persistence/NoResultException.java
AU        openjpa-persistence/src/main/java/org/apache/openjpa/persistence/PersistenceListenerAdapter.java
AU        openjpa-persistence/src/main/java/org/apache/openjpa/persistence/DetachStateType.java
A         openjpa-persistence/src/main/java/org/apache/openjpa/persistence/util
AU        openjpa-persistence/src/main/java/org/apache/openjpa/persistence/util/SourceCode.java
AU        openjpa-persistence/src/main/java/org/apache/openjpa/persistence/util/ReservedWords.java
AU        openjpa-persistence/src/main/java/org/apache/openjpa/persistence/util/package.html
AU        openjpa-persistence/src/main/java/org/apache/openjpa/persistence/OpenJPAQuerySPI.java
AU        openjpa-persistence/src/main/java/org/apache/openjpa/persistence/NonUniqueResultException.java
AU        openjpa-persistence/src/main/java/org/apache/openjpa/persistence/DetachedState.java
AU        openjpa-persistence/src/main/java/org/apache/openjpa/persistence/FetchPlan.java
A         openjpa-persistence/src/main/java/org/apache/openjpa/persistence/meta
AU        openjpa-persistence/src/main/java/org/apache/openjpa/persistence/meta/MetamodelImpl.java
AU        openjpa-persistence/src/main/java/org/apache/openjpa/persistence/meta/SourceAnnotationHandler.java
AU        openjpa-persistence/src/main/java/org/apache/openjpa/persistence/meta/Members.java
AU        openjpa-persistence/src/main/java/org/apache/openjpa/persistence/meta/package.html
AU        openjpa-persistence/src/main/java/org/apache/openjpa/persistence/meta/AnnotationProcessor6.java
AU        openjpa-persistence/src/main/java/org/apache/openjpa/persistence/meta/MetadataProcessor.java
AU        openjpa-persistence/src/main/java/org/apache/openjpa/persistence/meta/AbstractManagedType.java
AU        openjpa-persistence/src/main/java/org/apache/openjpa/persistence/meta/Types.java
AU        openjpa-persistence/src/main/java/org/apache/openjpa/persistence/meta/CompileTimeLogger.java
AU        openjpa-persistence/src/main/java/org/apache/openjpa/persistence/InverseLogical.java
AU        openjpa-persistence/src/main/java/org/apache/openjpa/persistence/LoadFetchGroup.java
AU        openjpa-persistence/src/main/java/org/apache/openjpa/persistence/InvalidStateException.java
AU        openjpa-persistence/src/main/java/org/apache/openjpa/persistence/Dependent.java
AU        openjpa-persistence/src/main/java/org/apache/openjpa/persistence/ConnectionRetainMode.java
AU        openjpa-persistence/src/main/java/org/apache/openjpa/persistence/EntityNotFoundException.java
AU        openjpa-persistence/src/main/java/org/apache/openjpa/persistence/AnnotationPersistenceMetaDataSerializer.java
AU        openjpa-persistence/src/main/java/org/apache/openjpa/persistence/PersistenceProductDerivation.java
AU        openjpa-persistence/src/main/java/org/apache/openjpa/persistence/ReadOnly.java
AU        openjpa-persistence/src/main/java/org/apache/openjpa/persistence/PersistenceProviderImpl.java
AU        openjpa-persistence/src/main/java/org/apache/openjpa/persistence/OpenJPAEnum.java
AU        openjpa-persistence/src/main/java/org/apache/openjpa/persistence/Type.java
AU        openjpa-persistence/src/main/java/org/apache/openjpa/persistence/PessimisticLockException.java
AU        openjpa-persistence/src/main/java/org/apache/openjpa/persistence/HintValueConverter.java
AU        openjpa-persistence/src/main/java/org/apache/openjpa/persistence/EntityManagerImpl.java
AU        openjpa-persistence/src/main/java/org/apache/openjpa/persistence/AbstractQuery.java
AU        openjpa-persistence/src/main/java/org/apache/openjpa/persistence/KeyType.java
AU        openjpa-persistence/src/main/java/org/apache/openjpa/persistence/ElementType.java
AU        openjpa-persistence/src/main/java/org/apache/openjpa/persistence/PersistentMap.java
AU        openjpa-persistence/src/main/java/org/apache/openjpa/persistence/LRS.java
AU        openjpa-persistence/src/main/java/org/apache/openjpa/persistence/OpenJPAEntityManagerSPI.java
AU        openjpa-persistence/src/main/java/org/apache/openjpa/persistence/Persistent.java
AU        openjpa-persistence/src/main/java/org/apache/openjpa/persistence/HintHandler.java
AU        openjpa-persistence/src/main/java/org/apache/openjpa/persistence/CallbackMode.java
AU        openjpa-persistence/src/main/java/org/apache/openjpa/persistence/LockScopesHelper.java
AU        openjpa-persistence/src/main/java/org/apache/openjpa/persistence/TransactionRequiredException.java
AU        openjpa-persistence/src/main/java/org/apache/openjpa/persistence/FetchGroup.java
AU        openjpa-persistence/src/main/java/org/apache/openjpa/persistence/RollbackException.java
AU        openjpa-persistence/src/main/java/org/apache/openjpa/persistence/QueryResultCacheImpl.java
AU        openjpa-persistence/src/main/java/org/apache/openjpa/persistence/TupleImpl.java
AU        openjpa-persistence/src/main/java/org/apache/openjpa/persistence/OptimisticLockException.java
AU        openjpa-persistence/src/main/java/org/apache/openjpa/persistence/PersistenceMetaDataFactory.java
AU        openjpa-persistence/src/main/java/org/apache/openjpa/persistence/PersistenceMetaDataDefaults.java
AU        openjpa-persistence/src/main/java/org/apache/openjpa/persistence/AnnotationPersistenceXMLMetaDataParser.java
AU        openjpa-persistence/src/main/java/org/apache/openjpa/persistence/KeyDependent.java
AU        openjpa-persistence/src/main/java/org/apache/openjpa/persistence/UpdateAction.java
A         openjpa-persistence/src/main/java/org/apache/openjpa/persistence/osgi
AU        openjpa-persistence/src/main/java/org/apache/openjpa/persistence/osgi/BundleDelegatingClassLoader.java
AU        openjpa-persistence/src/main/java/org/apache/openjpa/persistence/osgi/BundleUtils.java
AU        openjpa-persistence/src/main/java/org/apache/openjpa/persistence/osgi/package.html
AU        openjpa-persistence/src/main/java/org/apache/openjpa/persistence/osgi/PersistenceActivator.java
AU        openjpa-persistence/src/main/java/org/apache/openjpa/persistence/XMLPersistenceMetaDataParser.java
AU        openjpa-persistence/src/main/java/org/apache/openjpa/persistence/OpenJPAEntityManager.java
AU        openjpa-persistence/src/main/java/org/apache/openjpa/persistence/QueryImpl.java
AU        openjpa-persistence/src/main/java/org/apache/openjpa/persistence/QueryOperationType.java
AU        openjpa-persistence/src/main/java/org/apache/openjpa/persistence/QueryResultCache.java
AU        openjpa-persistence/src/main/java/org/apache/openjpa/persistence/ExtentImpl.java
A         openjpa-persistence/src/main/appended-resources
A         openjpa-persistence/src/main/appended-resources/META-INF
AU        openjpa-persistence/src/main/appended-resources/META-INF/NOTICE.vm
AU        openjpa-persistence/src/main/appended-resources/META-INF/LICENSE.vm
A         openjpa-persistence/src/main/resources
A         openjpa-persistence/src/main/resources/org
A         openjpa-persistence/src/main/resources/org/apache
A         openjpa-persistence/src/main/resources/org/apache/openjpa
A         openjpa-persistence/src/main/resources/org/apache/openjpa/persistence
AU        openjpa-persistence/src/main/resources/org/apache/openjpa/persistence/openjpa-orm.xsd
A         openjpa-persistence/src/main/resources/org/apache/openjpa/persistence/meta
AU        openjpa-persistence/src/main/resources/org/apache/openjpa/persistence/meta/localizer.properties
A         openjpa-persistence/src/main/resources/org/apache/openjpa/persistence/persistence-xsd.rsrc
A         openjpa-persistence/src/main/resources/org/apache/openjpa/persistence/persistence_2_0-xsd.rsrc
A         openjpa-persistence/src/main/resources/org/apache/openjpa/persistence/validation
AU        openjpa-persistence/src/main/resources/org/apache/openjpa/persistence/validation/localizer.properties
A         openjpa-persistence/src/main/resources/org/apache/openjpa/persistence/util
AU        openjpa-persistence/src/main/resources/org/apache/openjpa/persistence/util/localizer.properties
AU        openjpa-persistence/src/main/resources/org/apache/openjpa/persistence/localizer.properties
A         openjpa-persistence/src/main/resources/org/apache/openjpa/persistence/orm-xsd.rsrc
A         openjpa-persistence/src/main/resources/org/apache/openjpa/persistence/orm_2_0-xsd.rsrc
A         openjpa-persistence/src/main/resources/org/apache/openjpa/persistence/criteria
AU        openjpa-persistence/src/main/resources/org/apache/openjpa/persistence/criteria/localizer.properties
AU        openjpa-persistence/src/main/resources/org/apache/openjpa/persistence/extendable-orm.xsd
A         openjpa-persistence/src/main/resources/META-INF
A         openjpa-persistence/src/main/resources/META-INF/services
A         openjpa-persistence/src/main/resources/META-INF/services/javax.persistence.spi.PersistenceProvider
A         openjpa-persistence/src/main/resources/META-INF/services/org.apache.openjpa.kernel.exps.ExpressionParser
A         openjpa-persistence/src/main/resources/META-INF/services/org.apache.openjpa.lib.conf.ProductDerivation
 U        .
At revision 1803106

No changes for https://svn.apache.org/repos/asf/openjpa/trunk since the previous build
Setting ANT_1_9_7_HOME=/home/jenkins/tools/ant/apache-ant-1.9.7
Setting MAVEN_3_0_4_HOME=/home/jenkins/tools/maven/apache-maven-3.0.4
Setting JDK_1_8_LATEST__HOME=/home/jenkins/tools/java/latest1.8
[OpenJPA-trunk] $ /bin/bash -xe /tmp/jenkins7648144496382933723.sh
+ export ANT_HOME=/home/jenkins/tools/ant/apache-ant-1.9.7
+ ANT_HOME=/home/jenkins/tools/ant/apache-ant-1.9.7
+ export JAVA_HOME=/home/jenkins/tools/java/latest1.8
+ JAVA_HOME=/home/jenkins/tools/java/latest1.8
+ export M2_HOME=/home/jenkins/tools/maven/apache-maven-3.0.4
+ M2_HOME=/home/jenkins/tools/maven/apache-maven-3.0.4
+ export PATH=/home/jenkins/tools/ant/apache-ant-1.9.7/bin:/home/jenkins/tools/java/latest1.8/bin:/home/jenkins/tools/maven/apache-maven-3.0.4/bin:/home/jenkins/tools/java/latest1.8/bin:/usr/local/sbin:/usr/local/bin:/usr/sbin:/usr/bin:/sbin:/bin:/usr/games:/usr/local/games
+ PATH=/home/jenkins/tools/ant/apache-ant-1.9.7/bin:/home/jenkins/tools/java/latest1.8/bin:/home/jenkins/tools/maven/apache-maven-3.0.4/bin:/home/jenkins/tools/java/latest1.8/bin:/usr/local/sbin:/usr/local/bin:/usr/sbin:/usr/bin:/sbin:/bin:/usr/games:/usr/local/games
+ mvn clean install
[INFO] Scanning for projects...
[INFO] ------------------------------------------------------------------------
[INFO] BUILD FAILURE
[INFO] ------------------------------------------------------------------------
[INFO] Total time: 0.215s
[INFO] Finished at: Wed Jul 26 20:24:48 UTC 2017
[INFO] Final Memory: 10M/481M
[INFO] ------------------------------------------------------------------------
[ERROR] The goal you specified requires a project to execute but there is no POM in this directory (<https://builds.apache.org/job/OpenJPA-trunk/ws/).> Please verify you invoked Maven from the correct directory. -> [Help 1]
[ERROR]
[ERROR] To see the full stack trace of the errors, re-run Maven with the -e switch.
[ERROR] Re-run Maven using the -X switch to enable full debug logging.
[ERROR]
[ERROR] For more information about the errors and possible solutions, please read the following articles:
[ERROR] [Help 1] http://cwiki.apache.org/confluence/display/MAVEN/MissingProjectException
Build step 'Execute shell' marked build as failure
Archiving artifacts
Setting ANT_1_9_7_HOME=/home/jenkins/tools/ant/apache-ant-1.9.7
Setting MAVEN_3_0_4_HOME=/home/jenkins/tools/maven/apache-maven-3.0.4
Setting JDK_1_8_LATEST__HOME=/home/jenkins/tools/java/latest1.8
Recording test results
Setting ANT_1_9_7_HOME=/home/jenkins/tools/ant/apache-ant-1.9.7
Setting MAVEN_3_0_4_HOME=/home/jenkins/tools/maven/apache-maven-3.0.4
Setting JDK_1_8_LATEST__HOME=/home/jenkins/tools/java/latest1.8
ERROR: Step ‘Publish JUnit test result report’ failed: No test report files were found. Configuration error?
Setting ANT_1_9_7_HOME=/home/jenkins/tools/ant/apache-ant-1.9.7
Setting MAVEN_3_0_4_HOME=/home/jenkins/tools/maven/apache-maven-3.0.4
Setting JDK_1_8_LATEST__HOME=/home/jenkins/tools/java/latest1.8
Reply | Threaded
Open this post in threaded view
|  
Report Content as Inappropriate

Build failed in Jenkins: OpenJPA-trunk #6

Apache Jenkins Server-2
See <https://builds.apache.org/job/OpenJPA-trunk/6/display/redirect>

------------------------------------------
[...truncated 591.22 KB...]
AU        openjpa-persistence-jdbc/src/test/java/org/apache/openjpa/persistence/kernel/common/apps/LockGroupPC2.java
AU        openjpa-persistence-jdbc/src/test/java/org/apache/openjpa/persistence/kernel/common/apps/AttachF.java
AU        openjpa-persistence-jdbc/src/test/java/org/apache/openjpa/persistence/kernel/common/apps/UnAnnotPojo.java
AU        openjpa-persistence-jdbc/src/test/java/org/apache/openjpa/persistence/kernel/common/apps/TransactionalClassPC.java
AU        openjpa-persistence-jdbc/src/test/java/org/apache/openjpa/persistence/kernel/common/apps/DetachSMPC.java
AU        openjpa-persistence-jdbc/src/test/java/org/apache/openjpa/persistence/kernel/common/apps/AppIdSubE.java
AU        openjpa-persistence-jdbc/src/test/java/org/apache/openjpa/persistence/kernel/common/apps/AttachVersionB.java
AU        openjpa-persistence-jdbc/src/test/java/org/apache/openjpa/persistence/kernel/TestDynamicFetchPlan.java
AU        openjpa-persistence-jdbc/src/test/java/org/apache/openjpa/persistence/kernel/TestQueries.java
AU        openjpa-persistence-jdbc/src/test/java/org/apache/openjpa/persistence/kernel/TestPersistenceManager.java
AU        openjpa-persistence-jdbc/src/test/java/org/apache/openjpa/persistence/kernel/TestArrayValues2.java
AU        openjpa-persistence-jdbc/src/test/java/org/apache/openjpa/persistence/kernel/TestEJBRetainValues.java
AU        openjpa-persistence-jdbc/src/test/java/org/apache/openjpa/persistence/kernel/TestFieldState.java
AU        openjpa-persistence-jdbc/src/test/java/org/apache/openjpa/persistence/kernel/TestAbstractMappedAppIdSuper.java
AU        openjpa-persistence-jdbc/src/test/java/org/apache/openjpa/persistence/kernel/TestSerialize.java
AU        openjpa-persistence-jdbc/src/test/java/org/apache/openjpa/persistence/kernel/TestStateManagerImplData.java
AU        openjpa-persistence-jdbc/src/test/java/org/apache/openjpa/persistence/kernel/TestPCClass.java
AU        openjpa-persistence-jdbc/src/test/java/org/apache/openjpa/persistence/kernel/TestSimple.java
AU        openjpa-persistence-jdbc/src/test/java/org/apache/openjpa/persistence/kernel/TestFetchGroups.java
AU        openjpa-persistence-jdbc/src/test/java/org/apache/openjpa/persistence/kernel/TestStoreBlob.java
AU        openjpa-persistence-jdbc/src/test/java/org/apache/openjpa/persistence/kernel/TestSavepoints.java
AU        openjpa-persistence-jdbc/src/test/java/org/apache/openjpa/persistence/kernel/TestEJBGetObjectByIdValue.java
AU        openjpa-persistence-jdbc/src/test/java/org/apache/openjpa/persistence/kernel/TestOpenResultsCommit.java
AU        openjpa-persistence-jdbc/src/test/java/org/apache/openjpa/persistence/kernel/Test2EJBConcurrency.java
AU        openjpa-persistence-jdbc/src/test/java/org/apache/openjpa/persistence/kernel/TestRetainValuesInOptimistic.java
AU        openjpa-persistence-jdbc/src/test/java/org/apache/openjpa/persistence/kernel/TestInitialValueFetching.java
AU        openjpa-persistence-jdbc/src/test/java/org/apache/openjpa/persistence/kernel/TestCheckConsistency.java
AU        openjpa-persistence-jdbc/src/test/java/org/apache/openjpa/persistence/kernel/TestCalendarFields.java
AU        openjpa-persistence-jdbc/src/test/java/org/apache/openjpa/persistence/kernel/TestStaticInnerClasses.java
AU        openjpa-persistence-jdbc/src/test/java/org/apache/openjpa/persistence/kernel/TestEJBState.java
AU        openjpa-persistence-jdbc/src/test/java/org/apache/openjpa/persistence/kernel/TestEJBTransactionalClass.java
AU        openjpa-persistence-jdbc/src/test/java/org/apache/openjpa/persistence/kernel/TestEJBEmbedded.java
AU        openjpa-persistence-jdbc/src/test/java/org/apache/openjpa/persistence/kernel/TestProxies2.java
AU        openjpa-persistence-jdbc/src/test/java/org/apache/openjpa/persistence/kernel/TestTransition2.java
AU        openjpa-persistence-jdbc/src/test/java/org/apache/openjpa/persistence/kernel/TestSecondClassValues.java
AU        openjpa-persistence-jdbc/src/test/java/org/apache/openjpa/persistence/kernel/TestFetchGroupsExtent.java
AU        openjpa-persistence-jdbc/src/test/java/org/apache/openjpa/persistence/kernel/TestSavepointEmbedded.java
AU        openjpa-persistence-jdbc/src/test/java/org/apache/openjpa/persistence/kernel/TestSuppressBatchOLE.java
AU        openjpa-persistence-jdbc/src/test/java/org/apache/openjpa/persistence/kernel/TestMultipleInsertDeleteSameId.java
AU        openjpa-persistence-jdbc/src/test/java/org/apache/openjpa/persistence/kernel/TestEJBTransactions.java
AU        openjpa-persistence-jdbc/src/test/java/org/apache/openjpa/persistence/kernel/TestPersistenceManagerFactoryImpl.java
AU        openjpa-persistence-jdbc/src/test/java/org/apache/openjpa/persistence/kernel/TestSavepointEmbeddedPreFlush.java
AU        openjpa-persistence-jdbc/src/test/java/org/apache/openjpa/persistence/kernel/TestMultiThreaded.java
AU        openjpa-persistence-jdbc/src/test/java/org/apache/openjpa/persistence/kernel/TestSpecialNumbers2.java
AU        openjpa-persistence-jdbc/src/test/java/org/apache/openjpa/persistence/kernel/TestSavepointOrdering.java
AU        openjpa-persistence-jdbc/src/test/java/org/apache/openjpa/persistence/kernel/TestClassStringConstructor.java
AU        openjpa-persistence-jdbc/src/test/java/org/apache/openjpa/persistence/kernel/TestPessimisticLocking.java
AU        openjpa-persistence-jdbc/src/test/java/org/apache/openjpa/persistence/kernel/TestInstanceCallbacks.java
AU        openjpa-persistence-jdbc/src/test/java/org/apache/openjpa/persistence/kernel/TestEJBNoPersistentFields.java
AU        openjpa-persistence-jdbc/src/test/java/org/apache/openjpa/persistence/kernel/TestPMMemory.java
AU        openjpa-persistence-jdbc/src/test/java/org/apache/openjpa/persistence/kernel/TestConnectionRetainMode.java
AU        openjpa-persistence-jdbc/src/test/java/org/apache/openjpa/persistence/kernel/TestSequence.java
A         openjpa-persistence-jdbc/src/test/java/org/apache/openjpa/persistence/cascade
AU        openjpa-persistence-jdbc/src/test/java/org/apache/openjpa/persistence/cascade/VertexType.java
AU        openjpa-persistence-jdbc/src/test/java/org/apache/openjpa/persistence/cascade/Edge.java
AU        openjpa-persistence-jdbc/src/test/java/org/apache/openjpa/persistence/cascade/TestMultiCascadePersist.java
A         openjpa-persistence-jdbc/src/test/java/org/apache/openjpa/persistence/cascade/pudefault
AU        openjpa-persistence-jdbc/src/test/java/org/apache/openjpa/persistence/cascade/pudefault/PUDEntityA01.java
AU        openjpa-persistence-jdbc/src/test/java/org/apache/openjpa/persistence/cascade/pudefault/PUDEntityB.java
AU        openjpa-persistence-jdbc/src/test/java/org/apache/openjpa/persistence/cascade/pudefault/TestPUDefaultCascadePersist.java
AU        openjpa-persistence-jdbc/src/test/java/org/apache/openjpa/persistence/cascade/pudefault/PUDEntityA02.java
AU        openjpa-persistence-jdbc/src/test/java/org/apache/openjpa/persistence/cascade/pudefault/PUDEntityAE01.java
AU        openjpa-persistence-jdbc/src/test/java/org/apache/openjpa/persistence/cascade/pudefault/AnEmbeddable.java
AU        openjpa-persistence-jdbc/src/test/java/org/apache/openjpa/persistence/cascade/pudefault/TestNoPUDefaultCascadePersist.java
AU        openjpa-persistence-jdbc/src/test/java/org/apache/openjpa/persistence/cascade/pudefault/EmbeddableWithRelationships.java
AU        openjpa-persistence-jdbc/src/test/java/org/apache/openjpa/persistence/cascade/CascadePersistEntity.java
AU        openjpa-persistence-jdbc/src/test/java/org/apache/openjpa/persistence/cascade/TestCascadePersist.java
AU        openjpa-persistence-jdbc/src/test/java/org/apache/openjpa/persistence/cascade/Vertex.java
A         openjpa-persistence-jdbc/src/test/java/org/apache/openjpa/persistence/property
AU        openjpa-persistence-jdbc/src/test/java/org/apache/openjpa/persistence/property/IContact.java
AU        openjpa-persistence-jdbc/src/test/java/org/apache/openjpa/persistence/property/TestAccessMods.java
AU        openjpa-persistence-jdbc/src/test/java/org/apache/openjpa/persistence/property/EntityContact.java
AU        openjpa-persistence-jdbc/src/test/java/org/apache/openjpa/persistence/property/TestCompatAccessMods.java
AU        openjpa-persistence-jdbc/src/test/java/org/apache/openjpa/persistence/property/EmbeddableAddress.java
AU        openjpa-persistence-jdbc/src/test/java/org/apache/openjpa/persistence/property/IAddress.java
AU        openjpa-persistence-jdbc/src/test/java/org/apache/openjpa/persistence/property/TestCompatible.java
AU        openjpa-persistence-jdbc/src/test/java/org/apache/openjpa/persistence/property/AccessModsEntity.java
AU        openjpa-persistence-jdbc/src/test/java/org/apache/openjpa/persistence/property/PrivAccessModsEntity.java
A         openjpa-persistence-jdbc/src/test/java/org/apache/openjpa/conf
AU        openjpa-persistence-jdbc/src/test/java/org/apache/openjpa/conf/TestSpecificationConfiguration.java
AU        openjpa-persistence-jdbc/src/test/java/org/apache/openjpa/conf/TestQueryHints.java
AU        openjpa-persistence-jdbc/src/test/java/org/apache/openjpa/conf/TestBadJdbcUrl.java
AU        openjpa-persistence-jdbc/src/test/java/org/apache/openjpa/conf/TestDynamicConfiguration.java
AU        openjpa-persistence-jdbc/src/test/java/org/apache/openjpa/conf/TestBadAutoDetachProperty.java
AU        openjpa-persistence-jdbc/src/test/java/org/apache/openjpa/conf/TestCacheMarshaller.java
AU        openjpa-persistence-jdbc/src/test/java/org/apache/openjpa/conf/TestCacheMarshallerEndToEnd.java
AU        openjpa-persistence-jdbc/src/test/java/org/apache/openjpa/conf/TestQueryProperties.java
AU        openjpa-persistence-jdbc/src/test/java/org/apache/openjpa/conf/TestGetProperty.java
AU        openjpa-persistence-jdbc/src/test/java/org/apache/openjpa/conf/TestAutoDetachProperty.java
A         openjpa-persistence-jdbc/src/test/java/org/apache/openjpa/audit
AU        openjpa-persistence-jdbc/src/test/java/org/apache/openjpa/audit/TestAudit.java
AU        openjpa-persistence-jdbc/src/test/java/org/apache/openjpa/audit/X.java
AU        openjpa-persistence-jdbc/src/test/java/org/apache/openjpa/audit/TestBeginEventOnTransactionListener.java
AU        openjpa-persistence-jdbc/src/test/java/org/apache/openjpa/audit/AuditedEntry.java
AU        openjpa-persistence-jdbc/src/test/java/org/apache/openjpa/audit/InplaceAuditor.java
A         openjpa-persistence-jdbc/src/test/java/org/apache/openjpa/lib
A         openjpa-persistence-jdbc/src/test/java/org/apache/openjpa/lib/conf
AU        openjpa-persistence-jdbc/src/test/java/org/apache/openjpa/lib/conf/TestAnchorParsing.java
AU        openjpa-persistence-jdbc/src/test/java/org/apache/openjpa/lib/conf/TestEquivalentConfiguration.java
A         openjpa-persistence-jdbc/src/test/java/org/apache/openjpa/meta
AU        openjpa-persistence-jdbc/src/test/java/org/apache/openjpa/meta/Artist.java
AU        openjpa-persistence-jdbc/src/test/java/org/apache/openjpa/meta/Person.java
A         openjpa-persistence-jdbc/src/test/java/org/apache/openjpa/meta/Parent.java
AU        openjpa-persistence-jdbc/src/test/java/org/apache/openjpa/meta/AbstractThing.java
AU        openjpa-persistence-jdbc/src/test/java/org/apache/openjpa/meta/Item.java
AU        openjpa-persistence-jdbc/src/test/java/org/apache/openjpa/meta/PChildBi.java
A         openjpa-persistence-jdbc/src/test/java/org/apache/openjpa/meta/TestSecondaryTable.java
AU        openjpa-persistence-jdbc/src/test/java/org/apache/openjpa/meta/A.java
AU        openjpa-persistence-jdbc/src/test/java/org/apache/openjpa/meta/TestGetMetaData.java
AU        openjpa-persistence-jdbc/src/test/java/org/apache/openjpa/meta/B.java
AU        openjpa-persistence-jdbc/src/test/java/org/apache/openjpa/meta/C.java
AU        openjpa-persistence-jdbc/src/test/java/org/apache/openjpa/meta/Painter.java
AU        openjpa-persistence-jdbc/src/test/java/org/apache/openjpa/meta/TestMetaDataInheritanceComparator.java
A         openjpa-persistence-jdbc/src/test/java/org/apache/openjpa/meta/PChild.java
A         openjpa-persistence-jdbc/src/main
A         openjpa-persistence-jdbc/src/main/appended-resources
A         openjpa-persistence-jdbc/src/main/appended-resources/META-INF
AU        openjpa-persistence-jdbc/src/main/appended-resources/META-INF/NOTICE.vm
A         openjpa-persistence-jdbc/src/main/resources
A         openjpa-persistence-jdbc/src/main/resources/META-INF
A         openjpa-persistence-jdbc/src/main/resources/META-INF/services
A         openjpa-persistence-jdbc/src/main/resources/META-INF/services/org.apache.openjpa.lib.conf.ProductDerivation
A         openjpa-persistence-jdbc/src/main/resources/org
A         openjpa-persistence-jdbc/src/main/resources/org/apache
A         openjpa-persistence-jdbc/src/main/resources/org/apache/openjpa
A         openjpa-persistence-jdbc/src/main/resources/org/apache/openjpa/persistence
A         openjpa-persistence-jdbc/src/main/resources/org/apache/openjpa/persistence/jdbc
AU        openjpa-persistence-jdbc/src/main/resources/org/apache/openjpa/persistence/jdbc/localizer.properties
A         openjpa-persistence-jdbc/src/main/java
A         openjpa-persistence-jdbc/src/main/java/org
A         openjpa-persistence-jdbc/src/main/java/org/apache
A         openjpa-persistence-jdbc/src/main/java/org/apache/openjpa
A         openjpa-persistence-jdbc/src/main/java/org/apache/openjpa/persistence
A         openjpa-persistence-jdbc/src/main/java/org/apache/openjpa/persistence/jdbc
AU        openjpa-persistence-jdbc/src/main/java/org/apache/openjpa/persistence/jdbc/PersistenceMappingDefaults.java
AU        openjpa-persistence-jdbc/src/main/java/org/apache/openjpa/persistence/jdbc/ElementColumns.java
AU        openjpa-persistence-jdbc/src/main/java/org/apache/openjpa/persistence/jdbc/ResultSetType.java
AU        openjpa-persistence-jdbc/src/main/java/org/apache/openjpa/persistence/jdbc/Strategy.java
AU        openjpa-persistence-jdbc/src/main/java/org/apache/openjpa/persistence/jdbc/KeyColumn.java
AU        openjpa-persistence-jdbc/src/main/java/org/apache/openjpa/persistence/jdbc/XMappingOverrides.java
AU        openjpa-persistence-jdbc/src/main/java/org/apache/openjpa/persistence/jdbc/Index.java
AU        openjpa-persistence-jdbc/src/main/java/org/apache/openjpa/persistence/jdbc/AnnotationPersistenceMappingParser.java
AU        openjpa-persistence-jdbc/src/main/java/org/apache/openjpa/persistence/jdbc/XMLPersistenceMappingSerializer.java
A         openjpa-persistence-jdbc/src/main/java/org/apache/openjpa/persistence/jdbc/package.html
AU        openjpa-persistence-jdbc/src/main/java/org/apache/openjpa/persistence/jdbc/Nonpolymorphic.java
AU        openjpa-persistence-jdbc/src/main/java/org/apache/openjpa/persistence/jdbc/ElementIndex.java
AU        openjpa-persistence-jdbc/src/main/java/org/apache/openjpa/persistence/jdbc/KeyColumns.java
AU        openjpa-persistence-jdbc/src/main/java/org/apache/openjpa/persistence/jdbc/KeyNonpolymorphic.java
AU        openjpa-persistence-jdbc/src/main/java/org/apache/openjpa/persistence/jdbc/FetchDirection.java
AU        openjpa-persistence-jdbc/src/main/java/org/apache/openjpa/persistence/jdbc/MappingOverride.java
AU        openjpa-persistence-jdbc/src/main/java/org/apache/openjpa/persistence/jdbc/VersionColumn.java
AU        openjpa-persistence-jdbc/src/main/java/org/apache/openjpa/persistence/jdbc/EmbeddedMapping.java
AU        openjpa-persistence-jdbc/src/main/java/org/apache/openjpa/persistence/jdbc/VersionStrategy.java
AU        openjpa-persistence-jdbc/src/main/java/org/apache/openjpa/persistence/jdbc/ElementJoinColumns.java
AU        openjpa-persistence-jdbc/src/main/java/org/apache/openjpa/persistence/jdbc/ElementForeignKey.java
AU        openjpa-persistence-jdbc/src/main/java/org/apache/openjpa/persistence/jdbc/XTable.java
AU        openjpa-persistence-jdbc/src/main/java/org/apache/openjpa/persistence/jdbc/ElementEmbeddedMapping.java
AU        openjpa-persistence-jdbc/src/main/java/org/apache/openjpa/persistence/jdbc/DataStoreIdColumn.java
AU        openjpa-persistence-jdbc/src/main/java/org/apache/openjpa/persistence/jdbc/NonpolymorphicType.java
AU        openjpa-persistence-jdbc/src/main/java/org/apache/openjpa/persistence/jdbc/AnnotationPersistenceMappingSerializer.java
AU        openjpa-persistence-jdbc/src/main/java/org/apache/openjpa/persistence/jdbc/KeyJoinColumn.java
AU        openjpa-persistence-jdbc/src/main/java/org/apache/openjpa/persistence/jdbc/XSecondaryTable.java
AU        openjpa-persistence-jdbc/src/main/java/org/apache/openjpa/persistence/jdbc/IsolationLevel.java
AU        openjpa-persistence-jdbc/src/main/java/org/apache/openjpa/persistence/jdbc/OrderColumn.java
AU        openjpa-persistence-jdbc/src/main/java/org/apache/openjpa/persistence/jdbc/DiscriminatorStrategy.java
AU        openjpa-persistence-jdbc/src/main/java/org/apache/openjpa/persistence/jdbc/ForeignKeyAction.java
AU        openjpa-persistence-jdbc/src/main/java/org/apache/openjpa/persistence/jdbc/KeyClassCriteria.java
AU        openjpa-persistence-jdbc/src/main/java/org/apache/openjpa/persistence/jdbc/LRSSizeAlgorithm.java
AU        openjpa-persistence-jdbc/src/main/java/org/apache/openjpa/persistence/jdbc/Unique.java
AU        openjpa-persistence-jdbc/src/main/java/org/apache/openjpa/persistence/jdbc/ElementColumn.java
AU        openjpa-persistence-jdbc/src/main/java/org/apache/openjpa/persistence/jdbc/KeyJoinColumns.java
AU        openjpa-persistence-jdbc/src/main/java/org/apache/openjpa/persistence/jdbc/KeyStrategy.java
AU        openjpa-persistence-jdbc/src/main/java/org/apache/openjpa/persistence/jdbc/ElementStrategy.java
AU        openjpa-persistence-jdbc/src/main/java/org/apache/openjpa/persistence/jdbc/MappingOverrides.java
AU        openjpa-persistence-jdbc/src/main/java/org/apache/openjpa/persistence/jdbc/KeyEmbeddedMapping.java
AU        openjpa-persistence-jdbc/src/main/java/org/apache/openjpa/persistence/jdbc/XMappingOverride.java
AU        openjpa-persistence-jdbc/src/main/java/org/apache/openjpa/persistence/jdbc/VersionColumns.java
AU        openjpa-persistence-jdbc/src/main/java/org/apache/openjpa/persistence/jdbc/XJoinColumns.java
AU        openjpa-persistence-jdbc/src/main/java/org/apache/openjpa/persistence/jdbc/PersistenceMappingFactory.java
AU        openjpa-persistence-jdbc/src/main/java/org/apache/openjpa/persistence/jdbc/ClassCriteria.java
AU        openjpa-persistence-jdbc/src/main/java/org/apache/openjpa/persistence/jdbc/ContainerTable.java
AU        openjpa-persistence-jdbc/src/main/java/org/apache/openjpa/persistence/jdbc/ElementNonpolymorphic.java
AU        openjpa-persistence-jdbc/src/main/java/org/apache/openjpa/persistence/jdbc/JDBCPersistenceProductDerivation.java
AU        openjpa-persistence-jdbc/src/main/java/org/apache/openjpa/persistence/jdbc/XEmbeddedMapping.java
AU        openjpa-persistence-jdbc/src/main/java/org/apache/openjpa/persistence/jdbc/FetchMode.java
AU        openjpa-persistence-jdbc/src/main/java/org/apache/openjpa/persistence/jdbc/SubclassFetchMode.java
AU        openjpa-persistence-jdbc/src/main/java/org/apache/openjpa/persistence/jdbc/XMLPersistenceMappingParser.java
AU        openjpa-persistence-jdbc/src/main/java/org/apache/openjpa/persistence/jdbc/ForeignKey.java
AU        openjpa-persistence-jdbc/src/main/java/org/apache/openjpa/persistence/jdbc/EagerFetchMode.java
AU        openjpa-persistence-jdbc/src/main/java/org/apache/openjpa/persistence/jdbc/ElementClassCriteria.java
AU        openjpa-persistence-jdbc/src/main/java/org/apache/openjpa/persistence/jdbc/XJoinColumn.java
AU        openjpa-persistence-jdbc/src/main/java/org/apache/openjpa/persistence/jdbc/JoinSyntax.java
AU        openjpa-persistence-jdbc/src/main/java/org/apache/openjpa/persistence/jdbc/JDBCFetchPlanImpl.java
AU        openjpa-persistence-jdbc/src/main/java/org/apache/openjpa/persistence/jdbc/XSecondaryTables.java
AU        openjpa-persistence-jdbc/src/main/java/org/apache/openjpa/persistence/jdbc/KeyForeignKey.java
AU        openjpa-persistence-jdbc/src/main/java/org/apache/openjpa/persistence/jdbc/Columns.java
AU        openjpa-persistence-jdbc/src/main/java/org/apache/openjpa/persistence/jdbc/KeyIndex.java
AU        openjpa-persistence-jdbc/src/main/java/org/apache/openjpa/persistence/jdbc/JDBCFetchPlan.java
AU        openjpa-persistence-jdbc/src/main/java/org/apache/openjpa/persistence/jdbc/ElementJoinColumn.java
AU        openjpa-persistence-jdbc/src/main/java/org/apache/openjpa/persistence/jdbc/MappingTag.java
A         openjpa-persistence-jdbc/src/main/ant
AU        openjpa-persistence-jdbc/src/main/ant/enhancer.xml
AU        openjpa-persistence-jdbc/pom.xml
AU        patchoj.py
 U        .
At revision 1803106

No changes for https://svn.apache.org/repos/asf/openjpa/trunk since the previous build
Setting ANT_1_9_7_HOME=/home/jenkins/tools/ant/apache-ant-1.9.7
Setting MAVEN_3_0_4_HOME=/home/jenkins/tools/maven/apache-maven-3.0.4
Setting JDK_1_8_LATEST__HOME=/home/jenkins/tools/java/latest1.8
[OpenJPA-trunk] $ /bin/bash -xe /tmp/jenkins7738759486427140363.sh
+ export ANT_HOME=/home/jenkins/tools/ant/apache-ant-1.9.7
+ ANT_HOME=/home/jenkins/tools/ant/apache-ant-1.9.7
+ export JAVA_HOME=/home/jenkins/tools/java/latest1.8
+ JAVA_HOME=/home/jenkins/tools/java/latest1.8
+ export M2_HOME=/home/jenkins/tools/maven/apache-maven-3.0.4
+ M2_HOME=/home/jenkins/tools/maven/apache-maven-3.0.4
+ export PATH=/home/jenkins/tools/ant/apache-ant-1.9.7/bin:/home/jenkins/tools/java/latest1.8/bin:/home/jenkins/tools/maven/apache-maven-3.0.4/bin:/home/jenkins/tools/java/latest1.8/bin:/usr/local/sbin:/usr/local/bin:/usr/sbin:/usr/bin:/sbin:/bin:/usr/games:/usr/local/games
+ PATH=/home/jenkins/tools/ant/apache-ant-1.9.7/bin:/home/jenkins/tools/java/latest1.8/bin:/home/jenkins/tools/maven/apache-maven-3.0.4/bin:/home/jenkins/tools/java/latest1.8/bin:/usr/local/sbin:/usr/local/bin:/usr/sbin:/usr/bin:/sbin:/bin:/usr/games:/usr/local/games
+ mvn clean install
[INFO] Scanning for projects...
[INFO] ------------------------------------------------------------------------
[INFO] BUILD FAILURE
[INFO] ------------------------------------------------------------------------
[INFO] Total time: 0.122s
[INFO] Finished at: Wed Jul 26 20:33:38 UTC 2017
[INFO] Final Memory: 16M/1447M
[INFO] ------------------------------------------------------------------------
[ERROR] The goal you specified requires a project to execute but there is no POM in this directory (<https://builds.apache.org/job/OpenJPA-trunk/ws/).> Please verify you invoked Maven from the correct directory. -> [Help 1]
[ERROR]
[ERROR] To see the full stack trace of the errors, re-run Maven with the -e switch.
[ERROR] Re-run Maven using the -X switch to enable full debug logging.
[ERROR]
[ERROR] For more information about the errors and possible solutions, please read the following articles:
[ERROR] [Help 1] http://cwiki.apache.org/confluence/display/MAVEN/MissingProjectException
Build step 'Execute shell' marked build as failure
Archiving artifacts
Setting ANT_1_9_7_HOME=/home/jenkins/tools/ant/apache-ant-1.9.7
Setting MAVEN_3_0_4_HOME=/home/jenkins/tools/maven/apache-maven-3.0.4
Setting JDK_1_8_LATEST__HOME=/home/jenkins/tools/java/latest1.8
Recording test results
Setting ANT_1_9_7_HOME=/home/jenkins/tools/ant/apache-ant-1.9.7
Setting MAVEN_3_0_4_HOME=/home/jenkins/tools/maven/apache-maven-3.0.4
Setting JDK_1_8_LATEST__HOME=/home/jenkins/tools/java/latest1.8
ERROR: Step ?Publish JUnit test result report? failed: No test report files were found. Configuration error?
Setting ANT_1_9_7_HOME=/home/jenkins/tools/ant/apache-ant-1.9.7
Setting MAVEN_3_0_4_HOME=/home/jenkins/tools/maven/apache-maven-3.0.4
Setting JDK_1_8_LATEST__HOME=/home/jenkins/tools/java/latest1.8
Reply | Threaded
Open this post in threaded view
|  
Report Content as Inappropriate

Jenkins build is back to normal : OpenJPA-trunk #7

Apache Jenkins Server-2
Loading...