Build failed in Jenkins: OpenJPA-trunk-deploy #546

classic Classic list List threaded Threaded
6 messages Options
Reply | Threaded
Open this post in threaded view
|  
Report Content as Inappropriate

Build failed in Jenkins: OpenJPA-trunk-deploy #546

Apache Jenkins Server-2
See <https://builds.apache.org/job/OpenJPA-trunk-deploy/546/display/redirect?page=changes>

Changes:

[struberg] OPENJPA-2689 prevent IllegalArgumentException with package scoped OraclePreparedStatementWrapper classes

------------------------------------------
[...truncated 2.31 MB...]
[INFO] Exclude: **/.*/**
[INFO] Exclude: **/target/**/*
[INFO] 1 resources included (use -debug for more details)
[INFO] Rat check: Summary of files. Unapproved: 0 unknown: 0 generated: 0 approved: 0 licence.
[INFO]
[INFO] --- maven-install-plugin:2.5.2:install (default-install) @ openjpa-fetch-statistics-was ---
[INFO] Installing <https://builds.apache.org/job/OpenJPA-trunk-deploy/ws/trunk/openjpa-tools/openjpa-fetch-statistics-was/target/openjpa-fetch-statistics-was-3.0.0-SNAPSHOT.jar> to /home/jenkins/jenkins-slave/maven-repositories/0/org/apache/openjpa/openjpa-fetch-statistics-was/3.0.0-SNAPSHOT/openjpa-fetch-statistics-was-3.0.0-SNAPSHOT.jar
[INFO] Installing <https://builds.apache.org/job/OpenJPA-trunk-deploy/ws/trunk/openjpa-tools/openjpa-fetch-statistics-was/dependency-reduced-pom.xml> to /home/jenkins/jenkins-slave/maven-repositories/0/org/apache/openjpa/openjpa-fetch-statistics-was/3.0.0-SNAPSHOT/openjpa-fetch-statistics-was-3.0.0-SNAPSHOT.pom
[INFO] Installing <https://builds.apache.org/job/OpenJPA-trunk-deploy/ws/trunk/openjpa-tools/openjpa-fetch-statistics-was/target/openjpa-fetch-statistics-was-3.0.0-SNAPSHOT-tests.jar> to /home/jenkins/jenkins-slave/maven-repositories/0/org/apache/openjpa/openjpa-fetch-statistics-was/3.0.0-SNAPSHOT/openjpa-fetch-statistics-was-3.0.0-SNAPSHOT-tests.jar
[INFO]
[INFO] --- maven-deploy-plugin:2.8.2:deploy (default-deploy) @ openjpa-fetch-statistics-was ---
Downloading: https://repository.apache.org/content/repositories/snapshots/org/apache/openjpa/openjpa-fetch-statistics-was/3.0.0-SNAPSHOT/maven-metadata.xml
Downloaded: https://repository.apache.org/content/repositories/snapshots/org/apache/openjpa/openjpa-fetch-statistics-was/3.0.0-SNAPSHOT/maven-metadata.xml (1012 B at 1.7 KB/sec)
Uploading: https://repository.apache.org/content/repositories/snapshots/org/apache/openjpa/openjpa-fetch-statistics-was/3.0.0-SNAPSHOT/openjpa-fetch-statistics-was-3.0.0-20170228.072733-25.jar
Uploaded: https://repository.apache.org/content/repositories/snapshots/org/apache/openjpa/openjpa-fetch-statistics-was/3.0.0-SNAPSHOT/openjpa-fetch-statistics-was-3.0.0-20170228.072733-25.jar (21 KB at 23.5 KB/sec)
Uploading: https://repository.apache.org/content/repositories/snapshots/org/apache/openjpa/openjpa-fetch-statistics-was/3.0.0-SNAPSHOT/openjpa-fetch-statistics-was-3.0.0-20170228.072733-25.pom
Uploaded: https://repository.apache.org/content/repositories/snapshots/org/apache/openjpa/openjpa-fetch-statistics-was/3.0.0-SNAPSHOT/openjpa-fetch-statistics-was-3.0.0-20170228.072733-25.pom (4 KB at 4.1 KB/sec)
Downloading: https://repository.apache.org/content/repositories/snapshots/org/apache/openjpa/openjpa-fetch-statistics-was/maven-metadata.xml
Downloaded: https://repository.apache.org/content/repositories/snapshots/org/apache/openjpa/openjpa-fetch-statistics-was/maven-metadata.xml (427 B at 0.8 KB/sec)
Uploading: https://repository.apache.org/content/repositories/snapshots/org/apache/openjpa/openjpa-fetch-statistics-was/3.0.0-SNAPSHOT/maven-metadata.xml
Uploaded: https://repository.apache.org/content/repositories/snapshots/org/apache/openjpa/openjpa-fetch-statistics-was/3.0.0-SNAPSHOT/maven-metadata.xml (1012 B at 1.2 KB/sec)
Uploading: https://repository.apache.org/content/repositories/snapshots/org/apache/openjpa/openjpa-fetch-statistics-was/maven-metadata.xml
Uploaded: https://repository.apache.org/content/repositories/snapshots/org/apache/openjpa/openjpa-fetch-statistics-was/maven-metadata.xml (406 B at 0.5 KB/sec)
Uploading: https://repository.apache.org/content/repositories/snapshots/org/apache/openjpa/openjpa-fetch-statistics-was/3.0.0-SNAPSHOT/openjpa-fetch-statistics-was-3.0.0-20170228.072733-25-tests.jar
Uploaded: https://repository.apache.org/content/repositories/snapshots/org/apache/openjpa/openjpa-fetch-statistics-was/3.0.0-SNAPSHOT/openjpa-fetch-statistics-was-3.0.0-20170228.072733-25-tests.jar (9 KB at 9.9 KB/sec)
Uploading: https://repository.apache.org/content/repositories/snapshots/org/apache/openjpa/openjpa-fetch-statistics-was/3.0.0-SNAPSHOT/maven-metadata.xml
Uploaded: https://repository.apache.org/content/repositories/snapshots/org/apache/openjpa/openjpa-fetch-statistics-was/3.0.0-SNAPSHOT/maven-metadata.xml (1012 B at 1.2 KB/sec)
[INFO]                                                                        
[INFO] ------------------------------------------------------------------------
[INFO] Building OpenJPA Features 3.0.0-SNAPSHOT
[INFO] ------------------------------------------------------------------------
[INFO]
[INFO] --- maven-clean-plugin:3.0.0:clean (default-clean) @ openjpa-features ---
[INFO]
[INFO] --- buildnumber-maven-plugin:1.4:create (default) @ openjpa-features ---
[INFO]
[INFO] --- maven-enforcer-plugin:1.4.1:enforce (default) @ openjpa-features ---
[INFO]
[INFO] --- maven-checkstyle-plugin:2.9:checkstyle (default) @ openjpa-features ---
[INFO]
[INFO] --- maven-remote-resources-plugin:1.5:process (process-resource-bundles) @ openjpa-features ---
[INFO]
[INFO] --- karaf-maven-plugin:4.1.0:features-generate-descriptor (compile) @ openjpa-features ---
[WARNING] Error injecting: org.apache.karaf.tooling.features.GenerateDescriptorMojo
java.lang.TypeNotPresentException: Type org.apache.karaf.tooling.features.GenerateDescriptorMojo not present
        at org.sonatype.guice.bean.reflect.URLClassSpace.loadClass(URLClassSpace.java:109)
        at org.sonatype.guice.bean.reflect.NamedClass.load(NamedClass.java:45)
        at org.sonatype.guice.bean.reflect.AbstractDeferredClass.get(AbstractDeferredClass.java:45)
        at com.google.inject.internal.ProviderInternalFactory.provision(ProviderInternalFactory.java:84)
        at com.google.inject.internal.InternalFactoryToInitializableAdapter.provision(InternalFactoryToInitializableAdapter.java:52)
        at com.google.inject.internal.ProviderInternalFactory$1.call(ProviderInternalFactory.java:70)
        at com.google.inject.internal.ProvisionListenerStackCallback$Provision.provision(ProvisionListenerStackCallback.java:100)
        at org.sonatype.guice.plexus.lifecycles.PlexusLifecycleManager.onProvision(PlexusLifecycleManager.java:138)
        at com.google.inject.internal.ProvisionListenerStackCallback$Provision.provision(ProvisionListenerStackCallback.java:108)
        at com.google.inject.internal.ProvisionListenerStackCallback.provision(ProvisionListenerStackCallback.java:55)
        at com.google.inject.internal.ProviderInternalFactory.circularGet(ProviderInternalFactory.java:68)
        at com.google.inject.internal.InternalFactoryToInitializableAdapter.get(InternalFactoryToInitializableAdapter.java:45)
        at com.google.inject.internal.InjectorImpl$3$1.call(InjectorImpl.java:965)
        at com.google.inject.internal.InjectorImpl.callInContext(InjectorImpl.java:1011)
        at com.google.inject.internal.InjectorImpl$3.get(InjectorImpl.java:961)
        at com.google.inject.Scopes$1$1.get(Scopes.java:59)
        at org.sonatype.guice.bean.locators.LazyBeanEntry.getValue(LazyBeanEntry.java:83)
        at org.sonatype.guice.plexus.locators.LazyPlexusBean.getValue(LazyPlexusBean.java:49)
        at org.codehaus.plexus.DefaultPlexusContainer.lookup(DefaultPlexusContainer.java:253)
        at org.codehaus.plexus.DefaultPlexusContainer.lookup(DefaultPlexusContainer.java:245)
        at org.apache.maven.plugin.internal.DefaultMavenPluginManager.getConfiguredMojo(DefaultMavenPluginManager.java:455)
        at org.apache.maven.plugin.DefaultBuildPluginManager.executeMojo(DefaultBuildPluginManager.java:92)
        at org.apache.maven.lifecycle.internal.MojoExecutor.execute(MojoExecutor.java:209)
        at org.apache.maven.lifecycle.internal.MojoExecutor.execute(MojoExecutor.java:153)
        at org.apache.maven.lifecycle.internal.MojoExecutor.execute(MojoExecutor.java:145)
        at org.apache.maven.lifecycle.internal.LifecycleModuleBuilder.buildProject(LifecycleModuleBuilder.java:84)
        at org.apache.maven.lifecycle.internal.LifecycleModuleBuilder.buildProject(LifecycleModuleBuilder.java:59)
        at org.apache.maven.lifecycle.internal.LifecycleStarter.singleThreadedBuild(LifecycleStarter.java:183)
        at org.apache.maven.lifecycle.internal.LifecycleStarter.execute(LifecycleStarter.java:161)
        at org.apache.maven.DefaultMaven.doExecute(DefaultMaven.java:320)
        at org.apache.maven.DefaultMaven.execute(DefaultMaven.java:156)
        at org.jvnet.hudson.maven3.launcher.Maven3Launcher.main(Maven3Launcher.java:117)
        at sun.reflect.NativeMethodAccessorImpl.invoke0(Native Method)
        at sun.reflect.NativeMethodAccessorImpl.invoke(NativeMethodAccessorImpl.java:57)
        at sun.reflect.DelegatingMethodAccessorImpl.invoke(DelegatingMethodAccessorImpl.java:43)
        at java.lang.reflect.Method.invoke(Method.java:606)
        at org.codehaus.plexus.classworlds.launcher.Launcher.launchStandard(Launcher.java:329)
        at org.codehaus.plexus.classworlds.launcher.Launcher.launch(Launcher.java:239)
        at org.jvnet.hudson.maven3.agent.Maven3Main.launch(Maven3Main.java:181)
        at sun.reflect.NativeMethodAccessorImpl.invoke0(Native Method)
        at sun.reflect.NativeMethodAccessorImpl.invoke(NativeMethodAccessorImpl.java:57)
        at sun.reflect.DelegatingMethodAccessorImpl.invoke(DelegatingMethodAccessorImpl.java:43)
        at java.lang.reflect.Method.invoke(Method.java:606)
        at hudson.maven.Maven3Builder.call(Maven3Builder.java:139)
        at hudson.maven.Maven3Builder.call(Maven3Builder.java:70)
        at hudson.remoting.UserRequest.perform(UserRequest.java:153)
        at hudson.remoting.UserRequest.perform(UserRequest.java:50)
        at hudson.remoting.Request$2.run(Request.java:336)
        at hudson.remoting.InterceptingExecutorService$1.call(InterceptingExecutorService.java:68)
        at java.util.concurrent.FutureTask.run(FutureTask.java:262)
        at java.util.concurrent.ThreadPoolExecutor.runWorker(ThreadPoolExecutor.java:1145)
        at java.util.concurrent.ThreadPoolExecutor$Worker.run(ThreadPoolExecutor.java:615)
        at java.lang.Thread.run(Thread.java:745)
Caused by: java.lang.UnsupportedClassVersionError: org/apache/karaf/tooling/features/GenerateDescriptorMojo : Unsupported major.minor version 52.0
        at java.lang.ClassLoader.defineClass1(Native Method)
        at java.lang.ClassLoader.defineClass(ClassLoader.java:800)
        at java.security.SecureClassLoader.defineClass(SecureClassLoader.java:142)
        at java.net.URLClassLoader.defineClass(URLClassLoader.java:449)
        at java.net.URLClassLoader.access$100(URLClassLoader.java:71)
        at java.net.URLClassLoader$1.run(URLClassLoader.java:361)
        at java.net.URLClassLoader$1.run(URLClassLoader.java:355)
        at java.security.AccessController.doPrivileged(Native Method)
        at java.net.URLClassLoader.findClass(URLClassLoader.java:354)
        at org.codehaus.plexus.classworlds.realm.ClassRealm.loadClassFromSelf(ClassRealm.java:386)
        at org.codehaus.plexus.classworlds.strategy.SelfFirstStrategy.loadClass(SelfFirstStrategy.java:42)
        at org.codehaus.plexus.classworlds.realm.ClassRealm.loadClass(ClassRealm.java:244)
        at org.codehaus.plexus.classworlds.realm.ClassRealm.loadClass(ClassRealm.java:230)
        at org.sonatype.guice.bean.reflect.URLClassSpace.loadClass(URLClassSpace.java:101)
        ... 52 more
java.lang.reflect.InvocationTargetException
        at sun.reflect.NativeMethodAccessorImpl.invoke0(Native Method)
        at sun.reflect.NativeMethodAccessorImpl.invoke(NativeMethodAccessorImpl.java:57)
        at sun.reflect.DelegatingMethodAccessorImpl.invoke(DelegatingMethodAccessorImpl.java:43)
        at java.lang.reflect.Method.invoke(Method.java:606)
        at org.codehaus.plexus.classworlds.launcher.Launcher.launchStandard(Launcher.java:329)
        at org.codehaus.plexus.classworlds.launcher.Launcher.launch(Launcher.java:239)
        at org.jvnet.hudson.maven3.agent.Maven3Main.launch(Maven3Main.java:181)
        at sun.reflect.NativeMethodAccessorImpl.invoke0(Native Method)
        at sun.reflect.NativeMethodAccessorImpl.invoke(NativeMethodAccessorImpl.java:57)
        at sun.reflect.DelegatingMethodAccessorImpl.invoke(DelegatingMethodAccessorImpl.java:43)
        at java.lang.reflect.Method.invoke(Method.java:606)
        at hudson.maven.Maven3Builder.call(Maven3Builder.java:139)
        at hudson.maven.Maven3Builder.call(Maven3Builder.java:70)
        at hudson.remoting.UserRequest.perform(UserRequest.java:153)
        at hudson.remoting.UserRequest.perform(UserRequest.java:50)
        at hudson.remoting.Request$2.run(Request.java:336)
        at hudson.remoting.InterceptingExecutorService$1.call(InterceptingExecutorService.java:68)
        at java.util.concurrent.FutureTask.run(FutureTask.java:262)
        at java.util.concurrent.ThreadPoolExecutor.runWorker(ThreadPoolExecutor.java:1145)
        at java.util.concurrent.ThreadPoolExecutor$Worker.run(ThreadPoolExecutor.java:615)
        at java.lang.Thread.run(Thread.java:745)
Caused by: java.lang.UnsupportedClassVersionError: org/apache/karaf/tooling/features/GenerateDescriptorMojo : Unsupported major.minor version 52.0
        at java.lang.ClassLoader.defineClass1(Native Method)
        at java.lang.ClassLoader.defineClass(ClassLoader.java:800)
        at java.security.SecureClassLoader.defineClass(SecureClassLoader.java:142)
        at java.net.URLClassLoader.defineClass(URLClassLoader.java:449)
        at java.net.URLClassLoader.access$100(URLClassLoader.java:71)
        at java.net.URLClassLoader$1.run(URLClassLoader.java:361)
        at java.net.URLClassLoader$1.run(URLClassLoader.java:355)
        at java.security.AccessController.doPrivileged(Native Method)
        at java.net.URLClassLoader.findClass(URLClassLoader.java:354)
        at org.codehaus.plexus.classworlds.realm.ClassRealm.loadClassFromSelf(ClassRealm.java:386)
        at org.codehaus.plexus.classworlds.strategy.SelfFirstStrategy.loadClass(SelfFirstStrategy.java:42)
        at org.codehaus.plexus.classworlds.realm.ClassRealm.loadClass(ClassRealm.java:244)
        at org.codehaus.plexus.classworlds.realm.ClassRealm.loadClass(ClassRealm.java:230)
        at hudson.maven.ExecutedMojo.getMojoClass(ExecutedMojo.java:126)
        at hudson.maven.ExecutedMojo.<init>(ExecutedMojo.java:99)
        at hudson.maven.Maven3Builder$MavenExecutionListener.recordExecutionTime(Maven3Builder.java:654)
        at hudson.maven.Maven3Builder$MavenExecutionListener.recordMojoEnded(Maven3Builder.java:618)
        at hudson.maven.Maven3Builder$MavenExecutionListener.mojoFailed(Maven3Builder.java:662)
        at org.apache.maven.lifecycle.internal.DefaultExecutionEventCatapult.fire(DefaultExecutionEventCatapult.java:90)
        at org.apache.maven.lifecycle.internal.MojoExecutor.execute(MojoExecutor.java:232)
        at org.apache.maven.lifecycle.internal.MojoExecutor.execute(MojoExecutor.java:153)
        at org.apache.maven.lifecycle.internal.MojoExecutor.execute(MojoExecutor.java:145)
        at org.apache.maven.lifecycle.internal.LifecycleModuleBuilder.buildProject(LifecycleModuleBuilder.java:84)
        at org.apache.maven.lifecycle.internal.LifecycleModuleBuilder.buildProject(LifecycleModuleBuilder.java:59)
        at org.apache.maven.lifecycle.internal.LifecycleStarter.singleThreadedBuild(LifecycleStarter.java:183)
        at org.apache.maven.lifecycle.internal.LifecycleStarter.execute(LifecycleStarter.java:161)
        at org.apache.maven.DefaultMaven.doExecute(DefaultMaven.java:320)
        at org.apache.maven.DefaultMaven.execute(DefaultMaven.java:156)
        at org.jvnet.hudson.maven3.launcher.Maven3Launcher.main(Maven3Launcher.java:117)
        ... 21 more
ERROR: Failed to parse POMs
java.io.IOException: java.lang.reflect.InvocationTargetException
        at hudson.maven.Maven3Builder.call(Maven3Builder.java:179)
        at hudson.maven.Maven3Builder.call(Maven3Builder.java:70)
        at hudson.remoting.UserRequest.perform(UserRequest.java:153)
        at hudson.remoting.UserRequest.perform(UserRequest.java:50)
        at hudson.remoting.Request$2.run(Request.java:336)
        at hudson.remoting.InterceptingExecutorService$1.call(InterceptingExecutorService.java:68)
        at java.util.concurrent.FutureTask.run(FutureTask.java:262)
        at java.util.concurrent.ThreadPoolExecutor.runWorker(ThreadPoolExecutor.java:1145)
        at java.util.concurrent.ThreadPoolExecutor$Worker.run(ThreadPoolExecutor.java:615)
        at java.lang.Thread.run(Thread.java:745)
        at ......remote call to Channel to Maven [/home/jenkins/tools/java/latest1.7/bin/java, -Xmx1280m, -XX:MaxPermSize=512m, -cp, /home/jenkins/jenkins-slave/maven3-agent.jar:/home/jenkins/tools/maven/apache-maven-3.0.4/boot/plexus-classworlds-2.4.jar, org.jvnet.hudson.maven3.agent.Maven3Main, /home/jenkins/tools/maven/apache-maven-3.0.4, /home/jenkins/jenkins-slave/slave.jar, /home/jenkins/jenkins-slave/maven3-interceptor.jar, /home/jenkins/jenkins-slave/maven3-interceptor-commons.jar, 36207](Native Method)
        at hudson.remoting.Channel.attachCallSiteStackTrace(Channel.java:1537)
        at hudson.remoting.UserResponse.retrieve(UserRequest.java:253)
        at hudson.remoting.Channel.call(Channel.java:822)
        at hudson.maven.ProcessCache$MavenProcess.call(ProcessCache.java:161)
        at hudson.maven.MavenModuleSetBuild$MavenModuleSetBuildExecution.doRun(MavenModuleSetBuild.java:873)
        at hudson.model.AbstractBuild$AbstractBuildExecution.run(AbstractBuild.java:534)
        at hudson.model.Run.execute(Run.java:1728)
        at hudson.maven.MavenModuleSetBuild.run(MavenModuleSetBuild.java:544)
        at hudson.model.ResourceController.execute(ResourceController.java:98)
        at hudson.model.Executor.run(Executor.java:404)
Caused by: java.lang.reflect.InvocationTargetException
        at sun.reflect.NativeMethodAccessorImpl.invoke0(Native Method)
        at sun.reflect.NativeMethodAccessorImpl.invoke(NativeMethodAccessorImpl.java:57)
        at sun.reflect.DelegatingMethodAccessorImpl.invoke(DelegatingMethodAccessorImpl.java:43)
        at java.lang.reflect.Method.invoke(Method.java:606)
        at hudson.maven.Maven3Builder.call(Maven3Builder.java:139)
        at hudson.maven.Maven3Builder.call(Maven3Builder.java:70)
        at hudson.remoting.UserRequest.perform(UserRequest.java:153)
        at hudson.remoting.UserRequest.perform(UserRequest.java:50)
        at hudson.remoting.Request$2.run(Request.java:336)
        at hudson.remoting.InterceptingExecutorService$1.call(InterceptingExecutorService.java:68)
        at java.util.concurrent.FutureTask.run(FutureTask.java:262)
        at java.util.concurrent.ThreadPoolExecutor.runWorker(ThreadPoolExecutor.java:1145)
        at java.util.concurrent.ThreadPoolExecutor$Worker.run(ThreadPoolExecutor.java:615)
        at java.lang.Thread.run(Thread.java:745)
Caused by: java.lang.Exception: java.lang.reflect.InvocationTargetException
        at org.jvnet.hudson.maven3.agent.Maven3Main.launch(Maven3Main.java:184)
        ... 14 more
Caused by: java.lang.reflect.InvocationTargetException
        at sun.reflect.NativeMethodAccessorImpl.invoke0(Native Method)
        at sun.reflect.NativeMethodAccessorImpl.invoke(NativeMethodAccessorImpl.java:57)
        at sun.reflect.DelegatingMethodAccessorImpl.invoke(DelegatingMethodAccessorImpl.java:43)
        at java.lang.reflect.Method.invoke(Method.java:606)
        at org.codehaus.plexus.classworlds.launcher.Launcher.launchStandard(Launcher.java:329)
        at org.codehaus.plexus.classworlds.launcher.Launcher.launch(Launcher.java:239)
        at org.jvnet.hudson.maven3.agent.Maven3Main.launch(Maven3Main.java:181)
        ... 14 more
Caused by: java.lang.UnsupportedClassVersionError: org/apache/karaf/tooling/features/GenerateDescriptorMojo : Unsupported major.minor version 52.0
        at java.lang.ClassLoader.defineClass1(Native Method)
        at java.lang.ClassLoader.defineClass(ClassLoader.java:800)
        at java.security.SecureClassLoader.defineClass(SecureClassLoader.java:142)
        at java.net.URLClassLoader.defineClass(URLClassLoader.java:449)
        at java.net.URLClassLoader.access$100(URLClassLoader.java:71)
        at java.net.URLClassLoader$1.run(URLClassLoader.java:361)
        at java.net.URLClassLoader$1.run(URLClassLoader.java:355)
        at java.security.AccessController.doPrivileged(Native Method)
        at java.net.URLClassLoader.findClass(URLClassLoader.java:354)
        at org.codehaus.plexus.classworlds.realm.ClassRealm.loadClassFromSelf(ClassRealm.java:386)
        at org.codehaus.plexus.classworlds.strategy.SelfFirstStrategy.loadClass(SelfFirstStrategy.java:42)
        at org.codehaus.plexus.classworlds.realm.ClassRealm.loadClass(ClassRealm.java:244)
        at org.codehaus.plexus.classworlds.realm.ClassRealm.loadClass(ClassRealm.java:230)
        at hudson.maven.ExecutedMojo.getMojoClass(ExecutedMojo.java:126)
        at hudson.maven.ExecutedMojo.<init>(ExecutedMojo.java:99)
        at hudson.maven.Maven3Builder$MavenExecutionListener.recordExecutionTime(Maven3Builder.java:654)
        at hudson.maven.Maven3Builder$MavenExecutionListener.recordMojoEnded(Maven3Builder.java:618)
        at hudson.maven.Maven3Builder$MavenExecutionListener.mojoFailed(Maven3Builder.java:662)
        at org.apache.maven.lifecycle.internal.DefaultExecutionEventCatapult.fire(DefaultExecutionEventCatapult.java:90)
        at org.apache.maven.lifecycle.internal.MojoExecutor.execute(MojoExecutor.java:232)
        at org.apache.maven.lifecycle.internal.MojoExecutor.execute(MojoExecutor.java:153)
        at org.apache.maven.lifecycle.internal.MojoExecutor.execute(MojoExecutor.java:145)
        at org.apache.maven.lifecycle.internal.LifecycleModuleBuilder.buildProject(LifecycleModuleBuilder.java:84)
        at org.apache.maven.lifecycle.internal.LifecycleModuleBuilder.buildProject(LifecycleModuleBuilder.java:59)
        at org.apache.maven.lifecycle.internal.LifecycleStarter.singleThreadedBuild(LifecycleStarter.java:183)
        at org.apache.maven.lifecycle.internal.LifecycleStarter.execute(LifecycleStarter.java:161)
        at org.apache.maven.DefaultMaven.doExecute(DefaultMaven.java:320)
        at org.apache.maven.DefaultMaven.execute(DefaultMaven.java:156)
        at org.jvnet.hudson.maven3.launcher.Maven3Launcher.main(Maven3Launcher.java:117)
        ... 21 more
channel stopped
Reply | Threaded
Open this post in threaded view
|  
Report Content as Inappropriate

Build failed in Jenkins: OpenJPA-trunk-deploy #547

Apache Jenkins Server-2
See <https://builds.apache.org/job/OpenJPA-trunk-deploy/547/display/redirect?page=changes>

Changes:

[cschneider] [OPENJPA-2690] Update OSGi Import-Package to support Oracle CLOB/BLOB

------------------------------------------
[...truncated 2.33 MB...]
Downloading: http://repo.maven.apache.org/maven2/org/apache/karaf/diagnostic/diagnostic/4.1.0/diagnostic-4.1.0.pom
Downloaded: http://repo.maven.apache.org/maven2/org/apache/karaf/diagnostic/diagnostic/4.1.0/diagnostic-4.1.0.pom (2 KB at 9.8 KB/sec)
Downloading: http://repo.maven.apache.org/maven2/org/apache/karaf/org.apache.karaf.util/4.1.0/org.apache.karaf.util-4.1.0.jar
Downloading: http://repo.maven.apache.org/maven2/org/apache/karaf/jaas/org.apache.karaf.jaas.boot/4.1.0/org.apache.karaf.jaas.boot-4.1.0.jar
Downloading: http://repo.maven.apache.org/maven2/org/apache/karaf/tooling/org.apache.karaf.tools.utils/4.1.0/org.apache.karaf.tools.utils-4.1.0.jar
Downloading: http://repo.maven.apache.org/maven2/org/apache/felix/org.apache.felix.fileinstall/3.5.8/org.apache.felix.fileinstall-3.5.8.jar
Downloading: http://repo.maven.apache.org/maven2/org/apache/karaf/features/org.apache.karaf.features.core/4.1.0/org.apache.karaf.features.core-4.1.0.jar
Downloaded: http://repo.maven.apache.org/maven2/org/apache/karaf/jaas/org.apache.karaf.jaas.boot/4.1.0/org.apache.karaf.jaas.boot-4.1.0.jar (18 KB at 106.3 KB/sec)
Downloading: http://repo.maven.apache.org/maven2/org/apache/karaf/profile/org.apache.karaf.profile.core/4.1.0/org.apache.karaf.profile.core-4.1.0.jar
Downloaded: http://repo.maven.apache.org/maven2/org/apache/karaf/org.apache.karaf.util/4.1.0/org.apache.karaf.util-4.1.0.jar (67 KB at 390.5 KB/sec)
Downloading: http://repo.maven.apache.org/maven2/org/apache/karaf/deployer/org.apache.karaf.deployer.spring/4.1.0/org.apache.karaf.deployer.spring-4.1.0.jar
Downloaded: http://repo.maven.apache.org/maven2/org/apache/karaf/tooling/org.apache.karaf.tools.utils/4.1.0/org.apache.karaf.tools.utils-4.1.0.jar (27 KB at 157.1 KB/sec)
Downloading: http://repo.maven.apache.org/maven2/org/apache/karaf/deployer/org.apache.karaf.deployer.blueprint/4.1.0/org.apache.karaf.deployer.blueprint-4.1.0.jar
Downloaded: http://repo.maven.apache.org/maven2/org/apache/felix/org.apache.felix.fileinstall/3.5.8/org.apache.felix.fileinstall-3.5.8.jar (112 KB at 599.2 KB/sec)
Downloading: http://repo.maven.apache.org/maven2/org/apache/karaf/deployer/org.apache.karaf.deployer.features/4.1.0/org.apache.karaf.deployer.features-4.1.0.jar
Downloaded: http://repo.maven.apache.org/maven2/org/apache/karaf/deployer/org.apache.karaf.deployer.spring/4.1.0/org.apache.karaf.deployer.spring-4.1.0.jar (40 KB at 242.4 KB/sec)
Downloading: http://repo.maven.apache.org/maven2/org/apache/karaf/deployer/org.apache.karaf.deployer.kar/4.1.0/org.apache.karaf.deployer.kar-4.1.0.jar
Downloaded: http://repo.maven.apache.org/maven2/org/apache/karaf/deployer/org.apache.karaf.deployer.blueprint/4.1.0/org.apache.karaf.deployer.blueprint-4.1.0.jar (40 KB at 238.8 KB/sec)
Downloading: http://repo.maven.apache.org/maven2/org/apache/karaf/kar/org.apache.karaf.kar.core/4.1.0/org.apache.karaf.kar.core-4.1.0.jar
Downloaded: http://repo.maven.apache.org/maven2/org/apache/karaf/profile/org.apache.karaf.profile.core/4.1.0/org.apache.karaf.profile.core-4.1.0.jar (177 KB at 1010.3 KB/sec)
Downloading: http://repo.maven.apache.org/maven2/org/apache/karaf/shell/org.apache.karaf.shell.console/4.1.0/org.apache.karaf.shell.console-4.1.0.jar
Downloaded: http://repo.maven.apache.org/maven2/org/apache/karaf/deployer/org.apache.karaf.deployer.features/4.1.0/org.apache.karaf.deployer.features-4.1.0.jar (41 KB at 220.3 KB/sec)
Downloading: http://repo.maven.apache.org/maven2/org/jline/jline/3.1.3/jline-3.1.3.jar
Downloaded: http://repo.maven.apache.org/maven2/org/jline/jline/3.1.3/jline-3.1.3.jar (434 KB at 9847.8 KB/sec)
Downloading: http://repo.maven.apache.org/maven2/org/fusesource/jansi/jansi/1.14/jansi-1.14.jar
Downloaded: http://repo.maven.apache.org/maven2/org/apache/karaf/features/org.apache.karaf.features.core/4.1.0/org.apache.karaf.features.core-4.1.0.jar (575 KB at 1391.6 KB/sec)
Downloading: http://repo.maven.apache.org/maven2/org/apache/karaf/jaas/org.apache.karaf.jaas.modules/4.1.0/org.apache.karaf.jaas.modules-4.1.0.jar
Downloaded: http://repo.maven.apache.org/maven2/org/fusesource/jansi/jansi/1.14/jansi-1.14.jar (149 KB at 7055.8 KB/sec)
Downloading: http://repo.maven.apache.org/maven2/org/apache/karaf/jaas/org.apache.karaf.jaas.config/4.1.0/org.apache.karaf.jaas.config-4.1.0.jar
Downloaded: http://repo.maven.apache.org/maven2/org/apache/karaf/deployer/org.apache.karaf.deployer.kar/4.1.0/org.apache.karaf.deployer.kar-4.1.0.jar (22 KB at 134.9 KB/sec)
Downloading: http://repo.maven.apache.org/maven2/org/apache/karaf/shell/org.apache.karaf.shell.core/4.1.0/org.apache.karaf.shell.core-4.1.0.jar
Downloaded: http://repo.maven.apache.org/maven2/org/apache/karaf/kar/org.apache.karaf.kar.core/4.1.0/org.apache.karaf.kar.core-4.1.0.jar (75 KB at 441.0 KB/sec)
Downloading: http://repo.maven.apache.org/maven2/org/apache/sshd/sshd-core/1.2.0/sshd-core-1.2.0.jar
Downloaded: http://repo.maven.apache.org/maven2/org/apache/karaf/shell/org.apache.karaf.shell.console/4.1.0/org.apache.karaf.shell.console-4.1.0.jar (212 KB at 1141.6 KB/sec)
Downloading: http://repo.maven.apache.org/maven2/org/apache/karaf/org.apache.karaf.main/4.1.0/org.apache.karaf.main-4.1.0.jar
Downloaded: http://repo.maven.apache.org/maven2/org/apache/karaf/jaas/org.apache.karaf.jaas.config/4.1.0/org.apache.karaf.jaas.config-4.1.0.jar (42 KB at 253.6 KB/sec)
Downloading: http://repo.maven.apache.org/maven2/org/apache/karaf/diagnostic/org.apache.karaf.diagnostic.boot/4.1.0/org.apache.karaf.diagnostic.boot-4.1.0.jar
Downloaded: http://repo.maven.apache.org/maven2/org/apache/sshd/sshd-core/1.2.0/sshd-core-1.2.0.jar (1547 KB at 15781.2 KB/sec)
Downloaded: http://repo.maven.apache.org/maven2/org/apache/karaf/shell/org.apache.karaf.shell.core/4.1.0/org.apache.karaf.shell.core-4.1.0.jar (587 KB at 2960.9 KB/sec)
Downloaded: http://repo.maven.apache.org/maven2/org/apache/karaf/org.apache.karaf.main/4.1.0/org.apache.karaf.main-4.1.0.jar (116 KB at 647.0 KB/sec)
Downloaded: http://repo.maven.apache.org/maven2/org/apache/karaf/diagnostic/org.apache.karaf.diagnostic.boot/4.1.0/org.apache.karaf.diagnostic.boot-4.1.0.jar (31 KB at 187.1 KB/sec)
Downloaded: http://repo.maven.apache.org/maven2/org/apache/karaf/jaas/org.apache.karaf.jaas.modules/4.1.0/org.apache.karaf.jaas.modules-4.1.0.jar (1211 KB at 2451.3 KB/sec)
[WARNING] Error injecting: org.apache.karaf.tooling.features.GenerateDescriptorMojo
java.lang.TypeNotPresentException: Type org.apache.karaf.tooling.features.GenerateDescriptorMojo not present
        at org.sonatype.guice.bean.reflect.URLClassSpace.loadClass(URLClassSpace.java:109)
        at org.sonatype.guice.bean.reflect.NamedClass.load(NamedClass.java:45)
        at org.sonatype.guice.bean.reflect.AbstractDeferredClass.get(AbstractDeferredClass.java:45)
        at com.google.inject.internal.ProviderInternalFactory.provision(ProviderInternalFactory.java:84)
        at com.google.inject.internal.InternalFactoryToInitializableAdapter.provision(InternalFactoryToInitializableAdapter.java:52)
        at com.google.inject.internal.ProviderInternalFactory$1.call(ProviderInternalFactory.java:70)
        at com.google.inject.internal.ProvisionListenerStackCallback$Provision.provision(ProvisionListenerStackCallback.java:100)
        at org.sonatype.guice.plexus.lifecycles.PlexusLifecycleManager.onProvision(PlexusLifecycleManager.java:138)
        at com.google.inject.internal.ProvisionListenerStackCallback$Provision.provision(ProvisionListenerStackCallback.java:108)
        at com.google.inject.internal.ProvisionListenerStackCallback.provision(ProvisionListenerStackCallback.java:55)
        at com.google.inject.internal.ProviderInternalFactory.circularGet(ProviderInternalFactory.java:68)
        at com.google.inject.internal.InternalFactoryToInitializableAdapter.get(InternalFactoryToInitializableAdapter.java:45)
        at com.google.inject.internal.InjectorImpl$3$1.call(InjectorImpl.java:965)
        at com.google.inject.internal.InjectorImpl.callInContext(InjectorImpl.java:1011)
        at com.google.inject.internal.InjectorImpl$3.get(InjectorImpl.java:961)
        at com.google.inject.Scopes$1$1.get(Scopes.java:59)
        at org.sonatype.guice.bean.locators.LazyBeanEntry.getValue(LazyBeanEntry.java:83)
        at org.sonatype.guice.plexus.locators.LazyPlexusBean.getValue(LazyPlexusBean.java:49)
        at org.codehaus.plexus.DefaultPlexusContainer.lookup(DefaultPlexusContainer.java:253)
        at org.codehaus.plexus.DefaultPlexusContainer.lookup(DefaultPlexusContainer.java:245)
        at org.apache.maven.plugin.internal.DefaultMavenPluginManager.getConfiguredMojo(DefaultMavenPluginManager.java:455)
        at org.apache.maven.plugin.DefaultBuildPluginManager.executeMojo(DefaultBuildPluginManager.java:92)
        at org.apache.maven.lifecycle.internal.MojoExecutor.execute(MojoExecutor.java:209)
        at org.apache.maven.lifecycle.internal.MojoExecutor.execute(MojoExecutor.java:153)
        at org.apache.maven.lifecycle.internal.MojoExecutor.execute(MojoExecutor.java:145)
        at org.apache.maven.lifecycle.internal.LifecycleModuleBuilder.buildProject(LifecycleModuleBuilder.java:84)
        at org.apache.maven.lifecycle.internal.LifecycleModuleBuilder.buildProject(LifecycleModuleBuilder.java:59)
        at org.apache.maven.lifecycle.internal.LifecycleStarter.singleThreadedBuild(LifecycleStarter.java:183)
        at org.apache.maven.lifecycle.internal.LifecycleStarter.execute(LifecycleStarter.java:161)
        at org.apache.maven.DefaultMaven.doExecute(DefaultMaven.java:320)
        at org.apache.maven.DefaultMaven.execute(DefaultMaven.java:156)
        at org.jvnet.hudson.maven3.launcher.Maven3Launcher.main(Maven3Launcher.java:117)
        at sun.reflect.NativeMethodAccessorImpl.invoke0(Native Method)
        at sun.reflect.NativeMethodAccessorImpl.invoke(NativeMethodAccessorImpl.java:57)
        at sun.reflect.DelegatingMethodAccessorImpl.invoke(DelegatingMethodAccessorImpl.java:43)
        at java.lang.reflect.Method.invoke(Method.java:606)
        at org.codehaus.plexus.classworlds.launcher.Launcher.launchStandard(Launcher.java:329)
        at org.codehaus.plexus.classworlds.launcher.Launcher.launch(Launcher.java:239)
        at org.jvnet.hudson.maven3.agent.Maven3Main.launch(Maven3Main.java:181)
        at sun.reflect.NativeMethodAccessorImpl.invoke0(Native Method)
        at sun.reflect.NativeMethodAccessorImpl.invoke(NativeMethodAccessorImpl.java:57)
        at sun.reflect.DelegatingMethodAccessorImpl.invoke(DelegatingMethodAccessorImpl.java:43)
        at java.lang.reflect.Method.invoke(Method.java:606)
        at hudson.maven.Maven3Builder.call(Maven3Builder.java:139)
        at hudson.maven.Maven3Builder.call(Maven3Builder.java:70)
        at hudson.remoting.UserRequest.perform(UserRequest.java:153)
        at hudson.remoting.UserRequest.perform(UserRequest.java:50)
        at hudson.remoting.Request$2.run(Request.java:336)
        at hudson.remoting.InterceptingExecutorService$1.call(InterceptingExecutorService.java:68)
        at java.util.concurrent.FutureTask.run(FutureTask.java:262)
        at java.util.concurrent.ThreadPoolExecutor.runWorker(ThreadPoolExecutor.java:1145)
        at java.util.concurrent.ThreadPoolExecutor$Worker.run(ThreadPoolExecutor.java:615)
        at java.lang.Thread.run(Thread.java:745)
Caused by: java.lang.UnsupportedClassVersionError: org/apache/karaf/tooling/features/GenerateDescriptorMojo : Unsupported major.minor version 52.0
        at java.lang.ClassLoader.defineClass1(Native Method)
        at java.lang.ClassLoader.defineClass(ClassLoader.java:800)
        at java.security.SecureClassLoader.defineClass(SecureClassLoader.java:142)
        at java.net.URLClassLoader.defineClass(URLClassLoader.java:449)
        at java.net.URLClassLoader.access$100(URLClassLoader.java:71)
        at java.net.URLClassLoader$1.run(URLClassLoader.java:361)
        at java.net.URLClassLoader$1.run(URLClassLoader.java:355)
        at java.security.AccessController.doPrivileged(Native Method)
        at java.net.URLClassLoader.findClass(URLClassLoader.java:354)
        at org.codehaus.plexus.classworlds.realm.ClassRealm.loadClassFromSelf(ClassRealm.java:386)
        at org.codehaus.plexus.classworlds.strategy.SelfFirstStrategy.loadClass(SelfFirstStrategy.java:42)
        at org.codehaus.plexus.classworlds.realm.ClassRealm.loadClass(ClassRealm.java:244)
        at org.codehaus.plexus.classworlds.realm.ClassRealm.loadClass(ClassRealm.java:230)
        at org.sonatype.guice.bean.reflect.URLClassSpace.loadClass(URLClassSpace.java:101)
        ... 52 more
java.lang.reflect.InvocationTargetException
        at sun.reflect.NativeMethodAccessorImpl.invoke0(Native Method)
        at sun.reflect.NativeMethodAccessorImpl.invoke(NativeMethodAccessorImpl.java:57)
        at sun.reflect.DelegatingMethodAccessorImpl.invoke(DelegatingMethodAccessorImpl.java:43)
        at java.lang.reflect.Method.invoke(Method.java:606)
        at org.codehaus.plexus.classworlds.launcher.Launcher.launchStandard(Launcher.java:329)
        at org.codehaus.plexus.classworlds.launcher.Launcher.launch(Launcher.java:239)
        at org.jvnet.hudson.maven3.agent.Maven3Main.launch(Maven3Main.java:181)
        at sun.reflect.NativeMethodAccessorImpl.invoke0(Native Method)
        at sun.reflect.NativeMethodAccessorImpl.invoke(NativeMethodAccessorImpl.java:57)
        at sun.reflect.DelegatingMethodAccessorImpl.invoke(DelegatingMethodAccessorImpl.java:43)
        at java.lang.reflect.Method.invoke(Method.java:606)
        at hudson.maven.Maven3Builder.call(Maven3Builder.java:139)
        at hudson.maven.Maven3Builder.call(Maven3Builder.java:70)
        at hudson.remoting.UserRequest.perform(UserRequest.java:153)
        at hudson.remoting.UserRequest.perform(UserRequest.java:50)
        at hudson.remoting.Request$2.run(Request.java:336)
        at hudson.remoting.InterceptingExecutorService$1.call(InterceptingExecutorService.java:68)
        at java.util.concurrent.FutureTask.run(FutureTask.java:262)
        at java.util.concurrent.ThreadPoolExecutor.runWorker(ThreadPoolExecutor.java:1145)
        at java.util.concurrent.ThreadPoolExecutor$Worker.run(ThreadPoolExecutor.java:615)
        at java.lang.Thread.run(Thread.java:745)
Caused by: java.lang.UnsupportedClassVersionError: org/apache/karaf/tooling/features/GenerateDescriptorMojo : Unsupported major.minor version 52.0
        at java.lang.ClassLoader.defineClass1(Native Method)
        at java.lang.ClassLoader.defineClass(ClassLoader.java:800)
        at java.security.SecureClassLoader.defineClass(SecureClassLoader.java:142)
        at java.net.URLClassLoader.defineClass(URLClassLoader.java:449)
        at java.net.URLClassLoader.access$100(URLClassLoader.java:71)
        at java.net.URLClassLoader$1.run(URLClassLoader.java:361)
        at java.net.URLClassLoader$1.run(URLClassLoader.java:355)
        at java.security.AccessController.doPrivileged(Native Method)
        at java.net.URLClassLoader.findClass(URLClassLoader.java:354)
        at org.codehaus.plexus.classworlds.realm.ClassRealm.loadClassFromSelf(ClassRealm.java:386)
        at org.codehaus.plexus.classworlds.strategy.SelfFirstStrategy.loadClass(SelfFirstStrategy.java:42)
        at org.codehaus.plexus.classworlds.realm.ClassRealm.loadClass(ClassRealm.java:244)
        at org.codehaus.plexus.classworlds.realm.ClassRealm.loadClass(ClassRealm.java:230)
        at hudson.maven.ExecutedMojo.getMojoClass(ExecutedMojo.java:126)
        at hudson.maven.ExecutedMojo.<init>(ExecutedMojo.java:99)
        at hudson.maven.Maven3Builder$MavenExecutionListener.recordExecutionTime(Maven3Builder.java:654)
        at hudson.maven.Maven3Builder$MavenExecutionListener.recordMojoEnded(Maven3Builder.java:618)
        at hudson.maven.Maven3Builder$MavenExecutionListener.mojoFailed(Maven3Builder.java:662)
        at org.apache.maven.lifecycle.internal.DefaultExecutionEventCatapult.fire(DefaultExecutionEventCatapult.java:90)
        at org.apache.maven.lifecycle.internal.MojoExecutor.execute(MojoExecutor.java:232)
        at org.apache.maven.lifecycle.internal.MojoExecutor.execute(MojoExecutor.java:153)
        at org.apache.maven.lifecycle.internal.MojoExecutor.execute(MojoExecutor.java:145)
        at org.apache.maven.lifecycle.internal.LifecycleModuleBuilder.buildProject(LifecycleModuleBuilder.java:84)
        at org.apache.maven.lifecycle.internal.LifecycleModuleBuilder.buildProject(LifecycleModuleBuilder.java:59)
        at org.apache.maven.lifecycle.internal.LifecycleStarter.singleThreadedBuild(LifecycleStarter.java:183)
        at org.apache.maven.lifecycle.internal.LifecycleStarter.execute(LifecycleStarter.java:161)
        at org.apache.maven.DefaultMaven.doExecute(DefaultMaven.java:320)
        at org.apache.maven.DefaultMaven.execute(DefaultMaven.java:156)
        at org.jvnet.hudson.maven3.launcher.Maven3Launcher.main(Maven3Launcher.java:117)
        ... 21 more
Sending e-mails to: [hidden email]
ERROR: Failed to parse POMs
channel stopped
java.io.IOException: java.lang.reflect.InvocationTargetException
        at hudson.maven.Maven3Builder.call(Maven3Builder.java:179)
        at hudson.maven.Maven3Builder.call(Maven3Builder.java:70)
        at hudson.remoting.UserRequest.perform(UserRequest.java:153)
        at hudson.remoting.UserRequest.perform(UserRequest.java:50)
        at hudson.remoting.Request$2.run(Request.java:336)
        at hudson.remoting.InterceptingExecutorService$1.call(InterceptingExecutorService.java:68)
        at java.util.concurrent.FutureTask.run(FutureTask.java:262)
        at java.util.concurrent.ThreadPoolExecutor.runWorker(ThreadPoolExecutor.java:1145)
        at java.util.concurrent.ThreadPoolExecutor$Worker.run(ThreadPoolExecutor.java:615)
        at java.lang.Thread.run(Thread.java:745)
        at ......remote call to Channel to Maven [/home/jenkins/tools/java/latest1.7/bin/java, -Xmx1280m, -XX:MaxPermSize=512m, -cp, /home/jenkins/jenkins-slave/maven3-agent.jar:/home/jenkins/tools/maven/apache-maven-3.0.4/boot/plexus-classworlds-2.4.jar, org.jvnet.hudson.maven3.agent.Maven3Main, /home/jenkins/tools/maven/apache-maven-3.0.4, /home/jenkins/jenkins-slave/slave.jar, /home/jenkins/jenkins-slave/maven3-interceptor.jar, /home/jenkins/jenkins-slave/maven3-interceptor-commons.jar, 40620](Native Method)
        at hudson.remoting.Channel.attachCallSiteStackTrace(Channel.java:1537)
        at hudson.remoting.UserResponse.retrieve(UserRequest.java:253)
        at hudson.remoting.Channel.call(Channel.java:822)
        at hudson.maven.ProcessCache$MavenProcess.call(ProcessCache.java:161)
        at hudson.maven.MavenModuleSetBuild$MavenModuleSetBuildExecution.doRun(MavenModuleSetBuild.java:873)
        at hudson.model.AbstractBuild$AbstractBuildExecution.run(AbstractBuild.java:534)
        at hudson.model.Run.execute(Run.java:1728)
        at hudson.maven.MavenModuleSetBuild.run(MavenModuleSetBuild.java:544)
        at hudson.model.ResourceController.execute(ResourceController.java:98)
        at hudson.model.Executor.run(Executor.java:404)
Caused by: java.lang.reflect.InvocationTargetException
        at sun.reflect.NativeMethodAccessorImpl.invoke0(Native Method)
        at sun.reflect.NativeMethodAccessorImpl.invoke(NativeMethodAccessorImpl.java:57)
        at sun.reflect.DelegatingMethodAccessorImpl.invoke(DelegatingMethodAccessorImpl.java:43)
        at java.lang.reflect.Method.invoke(Method.java:606)
        at hudson.maven.Maven3Builder.call(Maven3Builder.java:139)
        at hudson.maven.Maven3Builder.call(Maven3Builder.java:70)
        at hudson.remoting.UserRequest.perform(UserRequest.java:153)
        at hudson.remoting.UserRequest.perform(UserRequest.java:50)
        at hudson.remoting.Request$2.run(Request.java:336)
        at hudson.remoting.InterceptingExecutorService$1.call(InterceptingExecutorService.java:68)
        at java.util.concurrent.FutureTask.run(FutureTask.java:262)
        at java.util.concurrent.ThreadPoolExecutor.runWorker(ThreadPoolExecutor.java:1145)
        at java.util.concurrent.ThreadPoolExecutor$Worker.run(ThreadPoolExecutor.java:615)
        at java.lang.Thread.run(Thread.java:745)
Caused by: java.lang.Exception: java.lang.reflect.InvocationTargetException
        at org.jvnet.hudson.maven3.agent.Maven3Main.launch(Maven3Main.java:184)
        ... 14 more
Caused by: java.lang.reflect.InvocationTargetException
        at sun.reflect.NativeMethodAccessorImpl.invoke0(Native Method)
        at sun.reflect.NativeMethodAccessorImpl.invoke(NativeMethodAccessorImpl.java:57)
        at sun.reflect.DelegatingMethodAccessorImpl.invoke(DelegatingMethodAccessorImpl.java:43)
        at java.lang.reflect.Method.invoke(Method.java:606)
        at org.codehaus.plexus.classworlds.launcher.Launcher.launchStandard(Launcher.java:329)
        at org.codehaus.plexus.classworlds.launcher.Launcher.launch(Launcher.java:239)
        at org.jvnet.hudson.maven3.agent.Maven3Main.launch(Maven3Main.java:181)
        ... 14 more
Caused by: java.lang.UnsupportedClassVersionError: org/apache/karaf/tooling/features/GenerateDescriptorMojo : Unsupported major.minor version 52.0
        at java.lang.ClassLoader.defineClass1(Native Method)
        at java.lang.ClassLoader.defineClass(ClassLoader.java:800)
        at java.security.SecureClassLoader.defineClass(SecureClassLoader.java:142)
        at java.net.URLClassLoader.defineClass(URLClassLoader.java:449)
        at java.net.URLClassLoader.access$100(URLClassLoader.java:71)
        at java.net.URLClassLoader$1.run(URLClassLoader.java:361)
        at java.net.URLClassLoader$1.run(URLClassLoader.java:355)
        at java.security.AccessController.doPrivileged(Native Method)
        at java.net.URLClassLoader.findClass(URLClassLoader.java:354)
        at org.codehaus.plexus.classworlds.realm.ClassRealm.loadClassFromSelf(ClassRealm.java:386)
        at org.codehaus.plexus.classworlds.strategy.SelfFirstStrategy.loadClass(SelfFirstStrategy.java:42)
        at org.codehaus.plexus.classworlds.realm.ClassRealm.loadClass(ClassRealm.java:244)
        at org.codehaus.plexus.classworlds.realm.ClassRealm.loadClass(ClassRealm.java:230)
        at hudson.maven.ExecutedMojo.getMojoClass(ExecutedMojo.java:126)
        at hudson.maven.ExecutedMojo.<init>(ExecutedMojo.java:99)
        at hudson.maven.Maven3Builder$MavenExecutionListener.recordExecutionTime(Maven3Builder.java:654)
        at hudson.maven.Maven3Builder$MavenExecutionListener.recordMojoEnded(Maven3Builder.java:618)
        at hudson.maven.Maven3Builder$MavenExecutionListener.mojoFailed(Maven3Builder.java:662)
        at org.apache.maven.lifecycle.internal.DefaultExecutionEventCatapult.fire(DefaultExecutionEventCatapult.java:90)
        at org.apache.maven.lifecycle.internal.MojoExecutor.execute(MojoExecutor.java:232)
        at org.apache.maven.lifecycle.internal.MojoExecutor.execute(MojoExecutor.java:153)
        at org.apache.maven.lifecycle.internal.MojoExecutor.execute(MojoExecutor.java:145)
        at org.apache.maven.lifecycle.internal.LifecycleModuleBuilder.buildProject(LifecycleModuleBuilder.java:84)
        at org.apache.maven.lifecycle.internal.LifecycleModuleBuilder.buildProject(LifecycleModuleBuilder.java:59)
        at org.apache.maven.lifecycle.internal.LifecycleStarter.singleThreadedBuild(LifecycleStarter.java:183)
        at org.apache.maven.lifecycle.internal.LifecycleStarter.execute(LifecycleStarter.java:161)
        at org.apache.maven.DefaultMaven.doExecute(DefaultMaven.java:320)
        at org.apache.maven.DefaultMaven.execute(DefaultMaven.java:156)
        at org.jvnet.hudson.maven3.launcher.Maven3Launcher.main(Maven3Launcher.java:117)
        ... 21 more
Reply | Threaded
Open this post in threaded view
|  
Report Content as Inappropriate

Build failed in Jenkins: OpenJPA-trunk-deploy #548

Apache Jenkins Server-2
See <https://builds.apache.org/job/OpenJPA-trunk-deploy/548/display/redirect?page=changes>

Changes:

[ilgrosso] [OPENJPA-2698] Applying the provided patch

------------------------------------------
[...truncated 2.32 MB...]
[INFO] Rat check: Summary of files. Unapproved: 0 unknown: 0 generated: 0 approved: 0 licence.
[INFO]
[INFO] --- maven-install-plugin:2.5.2:install (default-install) @ openjpa-fetch-statistics-was ---
[INFO] Installing <https://builds.apache.org/job/OpenJPA-trunk-deploy/ws/trunk/openjpa-tools/openjpa-fetch-statistics-was/target/openjpa-fetch-statistics-was-3.0.0-SNAPSHOT.jar> to /home/jenkins/jenkins-slave/maven-repositories/1/org/apache/openjpa/openjpa-fetch-statistics-was/3.0.0-SNAPSHOT/openjpa-fetch-statistics-was-3.0.0-SNAPSHOT.jar
[INFO] Installing <https://builds.apache.org/job/OpenJPA-trunk-deploy/ws/trunk/openjpa-tools/openjpa-fetch-statistics-was/dependency-reduced-pom.xml> to /home/jenkins/jenkins-slave/maven-repositories/1/org/apache/openjpa/openjpa-fetch-statistics-was/3.0.0-SNAPSHOT/openjpa-fetch-statistics-was-3.0.0-SNAPSHOT.pom
[INFO] Installing <https://builds.apache.org/job/OpenJPA-trunk-deploy/ws/trunk/openjpa-tools/openjpa-fetch-statistics-was/target/openjpa-fetch-statistics-was-3.0.0-SNAPSHOT-tests.jar> to /home/jenkins/jenkins-slave/maven-repositories/1/org/apache/openjpa/openjpa-fetch-statistics-was/3.0.0-SNAPSHOT/openjpa-fetch-statistics-was-3.0.0-SNAPSHOT-tests.jar
[INFO]
[INFO] --- maven-deploy-plugin:2.8.2:deploy (default-deploy) @ openjpa-fetch-statistics-was ---
Downloading: https://repository.apache.org/content/repositories/snapshots/org/apache/openjpa/openjpa-fetch-statistics-was/3.0.0-SNAPSHOT/maven-metadata.xml
Downloaded: https://repository.apache.org/content/repositories/snapshots/org/apache/openjpa/openjpa-fetch-statistics-was/3.0.0-SNAPSHOT/maven-metadata.xml (1012 B at 1.8 KB/sec)
Uploading: https://repository.apache.org/content/repositories/snapshots/org/apache/openjpa/openjpa-fetch-statistics-was/3.0.0-SNAPSHOT/openjpa-fetch-statistics-was-3.0.0-20170504.072814-27.jar
Uploaded: https://repository.apache.org/content/repositories/snapshots/org/apache/openjpa/openjpa-fetch-statistics-was/3.0.0-SNAPSHOT/openjpa-fetch-statistics-was-3.0.0-20170504.072814-27.jar (21 KB at 22.8 KB/sec)
Uploading: https://repository.apache.org/content/repositories/snapshots/org/apache/openjpa/openjpa-fetch-statistics-was/3.0.0-SNAPSHOT/openjpa-fetch-statistics-was-3.0.0-20170504.072814-27.pom
Uploaded: https://repository.apache.org/content/repositories/snapshots/org/apache/openjpa/openjpa-fetch-statistics-was/3.0.0-SNAPSHOT/openjpa-fetch-statistics-was-3.0.0-20170504.072814-27.pom (4 KB at 4.1 KB/sec)
Downloading: https://repository.apache.org/content/repositories/snapshots/org/apache/openjpa/openjpa-fetch-statistics-was/maven-metadata.xml
Downloaded: https://repository.apache.org/content/repositories/snapshots/org/apache/openjpa/openjpa-fetch-statistics-was/maven-metadata.xml (406 B at 0.7 KB/sec)
Uploading: https://repository.apache.org/content/repositories/snapshots/org/apache/openjpa/openjpa-fetch-statistics-was/3.0.0-SNAPSHOT/maven-metadata.xml
Uploaded: https://repository.apache.org/content/repositories/snapshots/org/apache/openjpa/openjpa-fetch-statistics-was/3.0.0-SNAPSHOT/maven-metadata.xml (1012 B at 1.2 KB/sec)
Uploading: https://repository.apache.org/content/repositories/snapshots/org/apache/openjpa/openjpa-fetch-statistics-was/maven-metadata.xml
Uploaded: https://repository.apache.org/content/repositories/snapshots/org/apache/openjpa/openjpa-fetch-statistics-was/maven-metadata.xml (406 B at 0.5 KB/sec)
Uploading: https://repository.apache.org/content/repositories/snapshots/org/apache/openjpa/openjpa-fetch-statistics-was/3.0.0-SNAPSHOT/openjpa-fetch-statistics-was-3.0.0-20170504.072814-27-tests.jar
Uploaded: https://repository.apache.org/content/repositories/snapshots/org/apache/openjpa/openjpa-fetch-statistics-was/3.0.0-SNAPSHOT/openjpa-fetch-statistics-was-3.0.0-20170504.072814-27-tests.jar (9 KB at 8.7 KB/sec)
Uploading: https://repository.apache.org/content/repositories/snapshots/org/apache/openjpa/openjpa-fetch-statistics-was/3.0.0-SNAPSHOT/maven-metadata.xml
Uploaded: https://repository.apache.org/content/repositories/snapshots/org/apache/openjpa/openjpa-fetch-statistics-was/3.0.0-SNAPSHOT/maven-metadata.xml (1012 B at 1.2 KB/sec)
[INFO]                                                                        
[INFO] ------------------------------------------------------------------------
[INFO] Building OpenJPA Features 3.0.0-SNAPSHOT
[INFO] ------------------------------------------------------------------------
Downloading: http://repo.maven.apache.org/maven2/org/apache/karaf/tooling/karaf-maven-plugin/maven-metadata.xml
Downloaded: http://repo.maven.apache.org/maven2/org/apache/karaf/tooling/karaf-maven-plugin/maven-metadata.xml (2 KB at 12.1 KB/sec)
[INFO]
[INFO] --- maven-clean-plugin:3.0.0:clean (default-clean) @ openjpa-features ---
[INFO]
[INFO] --- buildnumber-maven-plugin:1.4:create (default) @ openjpa-features ---
[INFO]
[INFO] --- maven-enforcer-plugin:1.4.1:enforce (default) @ openjpa-features ---
[INFO]
[INFO] --- maven-checkstyle-plugin:2.9:checkstyle (default) @ openjpa-features ---
[INFO]
[INFO] --- maven-remote-resources-plugin:1.5:process (process-resource-bundles) @ openjpa-features ---
[INFO]
[INFO] --- karaf-maven-plugin:4.1.1:features-generate-descriptor (compile) @ openjpa-features ---
[WARNING] Error injecting: org.apache.karaf.tooling.features.GenerateDescriptorMojo
java.lang.TypeNotPresentException: Type org.apache.karaf.tooling.features.GenerateDescriptorMojo not present
        at org.sonatype.guice.bean.reflect.URLClassSpace.loadClass(URLClassSpace.java:109)
        at org.sonatype.guice.bean.reflect.NamedClass.load(NamedClass.java:45)
        at org.sonatype.guice.bean.reflect.AbstractDeferredClass.get(AbstractDeferredClass.java:45)
        at com.google.inject.internal.ProviderInternalFactory.provision(ProviderInternalFactory.java:84)
        at com.google.inject.internal.InternalFactoryToInitializableAdapter.provision(InternalFactoryToInitializableAdapter.java:52)
        at com.google.inject.internal.ProviderInternalFactory$1.call(ProviderInternalFactory.java:70)
        at com.google.inject.internal.ProvisionListenerStackCallback$Provision.provision(ProvisionListenerStackCallback.java:100)
        at org.sonatype.guice.plexus.lifecycles.PlexusLifecycleManager.onProvision(PlexusLifecycleManager.java:138)
        at com.google.inject.internal.ProvisionListenerStackCallback$Provision.provision(ProvisionListenerStackCallback.java:108)
        at com.google.inject.internal.ProvisionListenerStackCallback.provision(ProvisionListenerStackCallback.java:55)
        at com.google.inject.internal.ProviderInternalFactory.circularGet(ProviderInternalFactory.java:68)
        at com.google.inject.internal.InternalFactoryToInitializableAdapter.get(InternalFactoryToInitializableAdapter.java:45)
        at com.google.inject.internal.InjectorImpl$3$1.call(InjectorImpl.java:965)
        at com.google.inject.internal.InjectorImpl.callInContext(InjectorImpl.java:1011)
        at com.google.inject.internal.InjectorImpl$3.get(InjectorImpl.java:961)
        at com.google.inject.Scopes$1$1.get(Scopes.java:59)
        at org.sonatype.guice.bean.locators.LazyBeanEntry.getValue(LazyBeanEntry.java:83)
        at org.sonatype.guice.plexus.locators.LazyPlexusBean.getValue(LazyPlexusBean.java:49)
        at org.codehaus.plexus.DefaultPlexusContainer.lookup(DefaultPlexusContainer.java:253)
        at org.codehaus.plexus.DefaultPlexusContainer.lookup(DefaultPlexusContainer.java:245)
        at org.apache.maven.plugin.internal.DefaultMavenPluginManager.getConfiguredMojo(DefaultMavenPluginManager.java:455)
        at org.apache.maven.plugin.DefaultBuildPluginManager.executeMojo(DefaultBuildPluginManager.java:92)
        at org.apache.maven.lifecycle.internal.MojoExecutor.execute(MojoExecutor.java:209)
        at org.apache.maven.lifecycle.internal.MojoExecutor.execute(MojoExecutor.java:153)
        at org.apache.maven.lifecycle.internal.MojoExecutor.execute(MojoExecutor.java:145)
        at org.apache.maven.lifecycle.internal.LifecycleModuleBuilder.buildProject(LifecycleModuleBuilder.java:84)
        at org.apache.maven.lifecycle.internal.LifecycleModuleBuilder.buildProject(LifecycleModuleBuilder.java:59)
        at org.apache.maven.lifecycle.internal.LifecycleStarter.singleThreadedBuild(LifecycleStarter.java:183)
        at org.apache.maven.lifecycle.internal.LifecycleStarter.execute(LifecycleStarter.java:161)
        at org.apache.maven.DefaultMaven.doExecute(DefaultMaven.java:320)
        at org.apache.maven.DefaultMaven.execute(DefaultMaven.java:156)
        at org.jvnet.hudson.maven3.launcher.Maven3Launcher.main(Maven3Launcher.java:117)
        at sun.reflect.NativeMethodAccessorImpl.invoke0(Native Method)
        at sun.reflect.NativeMethodAccessorImpl.invoke(NativeMethodAccessorImpl.java:57)
        at sun.reflect.DelegatingMethodAccessorImpl.invoke(DelegatingMethodAccessorImpl.java:43)
        at java.lang.reflect.Method.invoke(Method.java:606)
        at org.codehaus.plexus.classworlds.launcher.Launcher.launchStandard(Launcher.java:329)
        at org.codehaus.plexus.classworlds.launcher.Launcher.launch(Launcher.java:239)
        at org.jvnet.hudson.maven3.agent.Maven3Main.launch(Maven3Main.java:181)
        at sun.reflect.NativeMethodAccessorImpl.invoke0(Native Method)
        at sun.reflect.NativeMethodAccessorImpl.invoke(NativeMethodAccessorImpl.java:57)
        at sun.reflect.DelegatingMethodAccessorImpl.invoke(DelegatingMethodAccessorImpl.java:43)
        at java.lang.reflect.Method.invoke(Method.java:606)
        at hudson.maven.Maven3Builder.call(Maven3Builder.java:139)
        at hudson.maven.Maven3Builder.call(Maven3Builder.java:70)
        at hudson.remoting.UserRequest.perform(UserRequest.java:153)
        at hudson.remoting.UserRequest.perform(UserRequest.java:50)
        at hudson.remoting.Request$2.run(Request.java:336)
        at hudson.remoting.InterceptingExecutorService$1.call(InterceptingExecutorService.java:68)
        at java.util.concurrent.FutureTask.run(FutureTask.java:262)
        at java.util.concurrent.ThreadPoolExecutor.runWorker(ThreadPoolExecutor.java:1145)
        at java.util.concurrent.ThreadPoolExecutor$Worker.run(ThreadPoolExecutor.java:615)
        at java.lang.Thread.run(Thread.java:745)
Caused by: java.lang.UnsupportedClassVersionError: org/apache/karaf/tooling/features/GenerateDescriptorMojo : Unsupported major.minor version 52.0
        at java.lang.ClassLoader.defineClass1(Native Method)
        at java.lang.ClassLoader.defineClass(ClassLoader.java:800)
        at java.security.SecureClassLoader.defineClass(SecureClassLoader.java:142)
        at java.net.URLClassLoader.defineClass(URLClassLoader.java:449)
        at java.net.URLClassLoader.access$100(URLClassLoader.java:71)
        at java.net.URLClassLoader$1.run(URLClassLoader.java:361)
        at java.net.URLClassLoader$1.run(URLClassLoader.java:355)
        at java.security.AccessController.doPrivileged(Native Method)
        at java.net.URLClassLoader.findClass(URLClassLoader.java:354)
        at org.codehaus.plexus.classworlds.realm.ClassRealm.loadClassFromSelf(ClassRealm.java:386)
        at org.codehaus.plexus.classworlds.strategy.SelfFirstStrategy.loadClass(SelfFirstStrategy.java:42)
        at org.codehaus.plexus.classworlds.realm.ClassRealm.loadClass(ClassRealm.java:244)
        at org.codehaus.plexus.classworlds.realm.ClassRealm.loadClass(ClassRealm.java:230)
        at org.sonatype.guice.bean.reflect.URLClassSpace.loadClass(URLClassSpace.java:101)
        ... 52 more
java.lang.reflect.InvocationTargetException
        at sun.reflect.NativeMethodAccessorImpl.invoke0(Native Method)
        at sun.reflect.NativeMethodAccessorImpl.invoke(NativeMethodAccessorImpl.java:57)
        at sun.reflect.DelegatingMethodAccessorImpl.invoke(DelegatingMethodAccessorImpl.java:43)
        at java.lang.reflect.Method.invoke(Method.java:606)
        at org.codehaus.plexus.classworlds.launcher.Launcher.launchStandard(Launcher.java:329)
        at org.codehaus.plexus.classworlds.launcher.Launcher.launch(Launcher.java:239)
        at org.jvnet.hudson.maven3.agent.Maven3Main.launch(Maven3Main.java:181)
        at sun.reflect.NativeMethodAccessorImpl.invoke0(Native Method)
        at sun.reflect.NativeMethodAccessorImpl.invoke(NativeMethodAccessorImpl.java:57)
        at sun.reflect.DelegatingMethodAccessorImpl.invoke(DelegatingMethodAccessorImpl.java:43)
        at java.lang.reflect.Method.invoke(Method.java:606)
        at hudson.maven.Maven3Builder.call(Maven3Builder.java:139)
        at hudson.maven.Maven3Builder.call(Maven3Builder.java:70)
        at hudson.remoting.UserRequest.perform(UserRequest.java:153)
        at hudson.remoting.UserRequest.perform(UserRequest.java:50)
        at hudson.remoting.Request$2.run(Request.java:336)
        at hudson.remoting.InterceptingExecutorService$1.call(InterceptingExecutorService.java:68)
        at java.util.concurrent.FutureTask.run(FutureTask.java:262)
        at java.util.concurrent.ThreadPoolExecutor.runWorker(ThreadPoolExecutor.java:1145)
        at java.util.concurrent.ThreadPoolExecutor$Worker.run(ThreadPoolExecutor.java:615)
        at java.lang.Thread.run(Thread.java:745)
Caused by: java.lang.UnsupportedClassVersionError: org/apache/karaf/tooling/features/GenerateDescriptorMojo : Unsupported major.minor version 52.0
        at java.lang.ClassLoader.defineClass1(Native Method)
        at java.lang.ClassLoader.defineClass(ClassLoader.java:800)
        at java.security.SecureClassLoader.defineClass(SecureClassLoader.java:142)
        at java.net.URLClassLoader.defineClass(URLClassLoader.java:449)
        at java.net.URLClassLoader.access$100(URLClassLoader.java:71)
        at java.net.URLClassLoader$1.run(URLClassLoader.java:361)
        at java.net.URLClassLoader$1.run(URLClassLoader.java:355)
        at java.security.AccessController.doPrivileged(Native Method)
        at java.net.URLClassLoader.findClass(URLClassLoader.java:354)
        at org.codehaus.plexus.classworlds.realm.ClassRealm.loadClassFromSelf(ClassRealm.java:386)
        at org.codehaus.plexus.classworlds.strategy.SelfFirstStrategy.loadClass(SelfFirstStrategy.java:42)
        at org.codehaus.plexus.classworlds.realm.ClassRealm.loadClass(ClassRealm.java:244)
        at org.codehaus.plexus.classworlds.realm.ClassRealm.loadClass(ClassRealm.java:230)
        at hudson.maven.ExecutedMojo.getMojoClass(ExecutedMojo.java:126)
        at hudson.maven.ExecutedMojo.<init>(ExecutedMojo.java:99)
        at hudson.maven.Maven3Builder$MavenExecutionListener.recordExecutionTime(Maven3Builder.java:654)
        at hudson.maven.Maven3Builder$MavenExecutionListener.recordMojoEnded(Maven3Builder.java:618)
        at hudson.maven.Maven3Builder$MavenExecutionListener.mojoFailed(Maven3Builder.java:662)
        at org.apache.maven.lifecycle.internal.DefaultExecutionEventCatapult.fire(DefaultExecutionEventCatapult.java:90)
        at org.apache.maven.lifecycle.internal.MojoExecutor.execute(MojoExecutor.java:232)
        at org.apache.maven.lifecycle.internal.MojoExecutor.execute(MojoExecutor.java:153)
        at org.apache.maven.lifecycle.internal.MojoExecutor.execute(MojoExecutor.java:145)
        at org.apache.maven.lifecycle.internal.LifecycleModuleBuilder.buildProject(LifecycleModuleBuilder.java:84)
        at org.apache.maven.lifecycle.internal.LifecycleModuleBuilder.buildProject(LifecycleModuleBuilder.java:59)
        at org.apache.maven.lifecycle.internal.LifecycleStarter.singleThreadedBuild(LifecycleStarter.java:183)
        at org.apache.maven.lifecycle.internal.LifecycleStarter.execute(LifecycleStarter.java:161)
        at org.apache.maven.DefaultMaven.doExecute(DefaultMaven.java:320)
        at org.apache.maven.DefaultMaven.execute(DefaultMaven.java:156)
        at org.jvnet.hudson.maven3.launcher.Maven3Launcher.main(Maven3Launcher.java:117)
        ... 21 more
Sending e-mails to: [hidden email]
ERROR: Failed to parse POMs
java.io.IOException: java.lang.reflect.InvocationTargetException
        at hudson.maven.Maven3Builder.call(Maven3Builder.java:179)
        at hudson.maven.Maven3Builder.call(Maven3Builder.java:70)
        at hudson.remoting.UserRequest.perform(UserRequest.java:153)
        at hudson.remoting.UserRequest.perform(UserRequest.java:50)
        at hudson.remoting.Request$2.run(Request.java:336)
        at hudson.remoting.InterceptingExecutorService$1.call(InterceptingExecutorService.java:68)
        at java.util.concurrent.FutureTask.run(FutureTask.java:262)
        at java.util.concurrent.ThreadPoolExecutor.runWorker(ThreadPoolExecutor.java:1145)
        at java.util.concurrent.ThreadPoolExecutor$Worker.run(ThreadPoolExecutor.java:615)
        at java.lang.Thread.run(Thread.java:745)
        at ......remote call to Channel to Maven [/home/jenkins/tools/java/latest1.7/bin/java, -Xmx1280m, -XX:MaxPermSize=512m, -cp, /home/jenkins/jenkins-slave/maven3-agent.jar:/home/jenkins/tools/maven/apache-maven-3.0.4/boot/plexus-classworlds-2.4.jar, org.jvnet.hudson.maven3.agent.Maven3Main, /home/jenkins/tools/maven/apache-maven-3.0.4, /home/jenkins/jenkins-slave/slave.jar, /home/jenkins/jenkins-slave/maven3-interceptor.jar, /home/jenkins/jenkins-slave/maven3-interceptor-commons.jar, 39375](Native Method)
        at hudson.remoting.Channel.attachCallSiteStackTrace(Channel.java:1545)
        at hudson.remoting.UserResponse.retrieve(UserRequest.java:253)
        at hudson.remoting.Channel.call(Channel.java:830)
        at hudson.maven.ProcessCache$MavenProcess.call(ProcessCache.java:161)
        at hudson.maven.MavenModuleSetBuild$MavenModuleSetBuildExecution.doRun(MavenModuleSetBuild.java:873)
        at hudson.model.AbstractBuild$AbstractBuildExecution.run(AbstractBuild.java:534)
        at hudson.model.Run.execute(Run.java:1728)
        at hudson.maven.MavenModuleSetBuild.run(MavenModuleSetBuild.java:544)
        at hudson.model.ResourceController.execute(ResourceController.java:98)
        at hudson.model.Executor.run(Executor.java:405)
Caused by: java.lang.reflect.InvocationTargetException
        at sun.reflect.NativeMethodAccessorImpl.invoke0(Native Method)
        at sun.reflect.NativeMethodAccessorImpl.invoke(NativeMethodAccessorImpl.java:57)
        at sun.reflect.DelegatingMethodAccessorImpl.invoke(DelegatingMethodAccessorImpl.java:43)
        at java.lang.reflect.Method.invoke(Method.java:606)
        at hudson.maven.Maven3Builder.call(Maven3Builder.java:139)
        at hudson.maven.Maven3Builder.call(Maven3Builder.java:70)
        at hudson.remoting.UserRequest.perform(UserRequest.java:153)
        at hudson.remoting.UserRequest.perform(UserRequest.java:50)
        at hudson.remoting.Request$2.run(Request.java:336)
        at hudson.remoting.InterceptingExecutorService$1.call(InterceptingExecutorService.java:68)
        at java.util.concurrent.FutureTask.run(FutureTask.java:262)
        at java.util.concurrent.ThreadPoolExecutor.runWorker(ThreadPoolExecutor.java:1145)
        at java.util.concurrent.ThreadPoolExecutor$Worker.run(ThreadPoolExecutor.java:615)
        at java.lang.Thread.run(Thread.java:745)
Caused by: java.lang.Exception: java.lang.reflect.InvocationTargetException
        at org.jvnet.hudson.maven3.agent.Maven3Main.launch(Maven3Main.java:184)
        ... 14 more
Caused by: java.lang.reflect.InvocationTargetException
        at sun.reflect.NativeMethodAccessorImpl.invoke0(Native Method)
        at sun.reflect.NativeMethodAccessorImpl.invoke(NativeMethodAccessorImpl.java:57)
        at sun.reflect.DelegatingMethodAccessorImpl.invoke(DelegatingMethodAccessorImpl.java:43)
        at java.lang.reflect.Method.invoke(Method.java:606)
        at org.codehaus.plexus.classworlds.launcher.Launcher.launchStandard(Launcher.java:329)
        at org.codehaus.plexus.classworlds.launcher.Launcher.launch(Launcher.java:239)
        at org.jvnet.hudson.maven3.agent.Maven3Main.launch(Maven3Main.java:181)
        ... 14 more
Caused by: java.lang.UnsupportedClassVersionError: org/apache/karaf/tooling/features/GenerateDescriptorMojo : Unsupported major.minor version 52.0
        at java.lang.ClassLoader.defineClass1(Native Method)
        at java.lang.ClassLoader.defineClass(ClassLoader.java:800)
        at java.security.SecureClassLoader.defineClass(SecureClassLoader.java:142)
        at java.net.URLClassLoader.defineClass(URLClassLoader.java:449)
        at java.net.URLClassLoader.access$100(URLClassLoader.java:71)
        at java.net.URLClassLoader$1.run(URLClassLoader.java:361)
        at java.net.URLClassLoader$1.run(URLClassLoader.java:355)
        at java.security.AccessController.doPrivileged(Native Method)
        at java.net.URLClassLoader.findClass(URLClassLoader.java:354)
        at org.codehaus.plexus.classworlds.realm.ClassRealm.loadClassFromSelf(ClassRealm.java:386)
        at org.codehaus.plexus.classworlds.strategy.SelfFirstStrategy.loadClass(SelfFirstStrategy.java:42)
        at org.codehaus.plexus.classworlds.realm.ClassRealm.loadClass(ClassRealm.java:244)
        at org.codehaus.plexus.classworlds.realm.ClassRealm.loadClass(ClassRealm.java:230)
        at hudson.maven.ExecutedMojo.getMojoClass(ExecutedMojo.java:126)
        at hudson.maven.ExecutedMojo.<init>(ExecutedMojo.java:99)
        at hudson.maven.Maven3Builder$MavenExecutionListener.recordExecutionTime(Maven3Builder.java:654)
        at hudson.maven.Maven3Builder$MavenExecutionListener.recordMojoEnded(Maven3Builder.java:618)
        at hudson.maven.Maven3Builder$MavenExecutionListener.mojoFailed(Maven3Builder.java:662)
        at org.apache.maven.lifecycle.internal.DefaultExecutionEventCatapult.fire(DefaultExecutionEventCatapult.java:90)
        at org.apache.maven.lifecycle.internal.MojoExecutor.execute(MojoExecutor.java:232)
        at org.apache.maven.lifecycle.internal.MojoExecutor.execute(MojoExecutor.java:153)
        at org.apache.maven.lifecycle.internal.MojoExecutor.execute(MojoExecutor.java:145)
        at org.apache.maven.lifecycle.internal.LifecycleModuleBuilder.buildProject(LifecycleModuleBuilder.java:84)
        at org.apache.maven.lifecycle.internal.LifecycleModuleBuilder.buildProject(LifecycleModuleBuilder.java:59)
        at org.apache.maven.lifecycle.internal.LifecycleStarter.singleThreadedBuild(LifecycleStarter.java:183)
        at org.apache.maven.lifecycle.internal.LifecycleStarter.execute(LifecycleStarter.java:161)
        at org.apache.maven.DefaultMaven.doExecute(DefaultMaven.java:320)
        at org.apache.maven.DefaultMaven.execute(DefaultMaven.java:156)
        at org.jvnet.hudson.maven3.launcher.Maven3Launcher.main(Maven3Launcher.java:117)
        ... 21 more
channel stopped
Reply | Threaded
Open this post in threaded view
|  
Report Content as Inappropriate

Build failed in Jenkins: OpenJPA-trunk-deploy #549

Apache Jenkins Server-2
See <https://builds.apache.org/job/OpenJPA-trunk-deploy/549/display/redirect?page=changes>

Changes:

[ilgrosso] Reverting unadverted change to JPQLExpressionBuilder in r1797211

[ilgrosso] changed version of maven-jar-plugin to 3.0.2 - This closes #8

------------------------------------------
[...truncated 2.31 MB...]
[INFO] 1 resources included (use -debug for more details)
[INFO] Rat check: Summary of files. Unapproved: 0 unknown: 0 generated: 0 approved: 0 licence.
[INFO]
[INFO] --- maven-install-plugin:2.5.2:install (default-install) @ openjpa-fetch-statistics-was ---
[INFO] Installing <https://builds.apache.org/job/OpenJPA-trunk-deploy/ws/trunk/openjpa-tools/openjpa-fetch-statistics-was/target/openjpa-fetch-statistics-was-3.0.0-SNAPSHOT.jar> to /home/jenkins/jenkins-slave/maven-repositories/1/org/apache/openjpa/openjpa-fetch-statistics-was/3.0.0-SNAPSHOT/openjpa-fetch-statistics-was-3.0.0-SNAPSHOT.jar
[INFO] Installing <https://builds.apache.org/job/OpenJPA-trunk-deploy/ws/trunk/openjpa-tools/openjpa-fetch-statistics-was/dependency-reduced-pom.xml> to /home/jenkins/jenkins-slave/maven-repositories/1/org/apache/openjpa/openjpa-fetch-statistics-was/3.0.0-SNAPSHOT/openjpa-fetch-statistics-was-3.0.0-SNAPSHOT.pom
[INFO] Installing <https://builds.apache.org/job/OpenJPA-trunk-deploy/ws/trunk/openjpa-tools/openjpa-fetch-statistics-was/target/openjpa-fetch-statistics-was-3.0.0-SNAPSHOT-tests.jar> to /home/jenkins/jenkins-slave/maven-repositories/1/org/apache/openjpa/openjpa-fetch-statistics-was/3.0.0-SNAPSHOT/openjpa-fetch-statistics-was-3.0.0-SNAPSHOT-tests.jar
[INFO]
[INFO] --- maven-deploy-plugin:2.8.2:deploy (default-deploy) @ openjpa-fetch-statistics-was ---
Downloading: https://repository.apache.org/content/repositories/snapshots/org/apache/openjpa/openjpa-fetch-statistics-was/3.0.0-SNAPSHOT/maven-metadata.xml
Downloaded: https://repository.apache.org/content/repositories/snapshots/org/apache/openjpa/openjpa-fetch-statistics-was/3.0.0-SNAPSHOT/maven-metadata.xml (1012 B at 1.7 KB/sec)
Uploading: https://repository.apache.org/content/repositories/snapshots/org/apache/openjpa/openjpa-fetch-statistics-was/3.0.0-SNAPSHOT/openjpa-fetch-statistics-was-3.0.0-20170602.072946-28.jar
Uploaded: https://repository.apache.org/content/repositories/snapshots/org/apache/openjpa/openjpa-fetch-statistics-was/3.0.0-SNAPSHOT/openjpa-fetch-statistics-was-3.0.0-20170602.072946-28.jar (21 KB at 22.3 KB/sec)
Uploading: https://repository.apache.org/content/repositories/snapshots/org/apache/openjpa/openjpa-fetch-statistics-was/3.0.0-SNAPSHOT/openjpa-fetch-statistics-was-3.0.0-20170602.072946-28.pom
Uploaded: https://repository.apache.org/content/repositories/snapshots/org/apache/openjpa/openjpa-fetch-statistics-was/3.0.0-SNAPSHOT/openjpa-fetch-statistics-was-3.0.0-20170602.072946-28.pom (4 KB at 4.1 KB/sec)
Downloading: https://repository.apache.org/content/repositories/snapshots/org/apache/openjpa/openjpa-fetch-statistics-was/maven-metadata.xml
Downloaded: https://repository.apache.org/content/repositories/snapshots/org/apache/openjpa/openjpa-fetch-statistics-was/maven-metadata.xml (406 B at 0.7 KB/sec)
Uploading: https://repository.apache.org/content/repositories/snapshots/org/apache/openjpa/openjpa-fetch-statistics-was/3.0.0-SNAPSHOT/maven-metadata.xml
Uploaded: https://repository.apache.org/content/repositories/snapshots/org/apache/openjpa/openjpa-fetch-statistics-was/3.0.0-SNAPSHOT/maven-metadata.xml (1012 B at 1.1 KB/sec)
Uploading: https://repository.apache.org/content/repositories/snapshots/org/apache/openjpa/openjpa-fetch-statistics-was/maven-metadata.xml
Uploaded: https://repository.apache.org/content/repositories/snapshots/org/apache/openjpa/openjpa-fetch-statistics-was/maven-metadata.xml (406 B at 0.5 KB/sec)
Uploading: https://repository.apache.org/content/repositories/snapshots/org/apache/openjpa/openjpa-fetch-statistics-was/3.0.0-SNAPSHOT/openjpa-fetch-statistics-was-3.0.0-20170602.072946-28-tests.jar
Uploaded: https://repository.apache.org/content/repositories/snapshots/org/apache/openjpa/openjpa-fetch-statistics-was/3.0.0-SNAPSHOT/openjpa-fetch-statistics-was-3.0.0-20170602.072946-28-tests.jar (9 KB at 9.5 KB/sec)
Uploading: https://repository.apache.org/content/repositories/snapshots/org/apache/openjpa/openjpa-fetch-statistics-was/3.0.0-SNAPSHOT/maven-metadata.xml
Uploaded: https://repository.apache.org/content/repositories/snapshots/org/apache/openjpa/openjpa-fetch-statistics-was/3.0.0-SNAPSHOT/maven-metadata.xml (1012 B at 1.2 KB/sec)
[INFO]                                                                        
[INFO] ------------------------------------------------------------------------
[INFO] Building OpenJPA Features 3.0.0-SNAPSHOT
[INFO] ------------------------------------------------------------------------
Downloading: http://repo.maven.apache.org/maven2/org/apache/karaf/tooling/karaf-maven-plugin/maven-metadata.xml
Downloaded: http://repo.maven.apache.org/maven2/org/apache/karaf/tooling/karaf-maven-plugin/maven-metadata.xml (2 KB at 5.8 KB/sec)
[INFO]
[INFO] --- maven-clean-plugin:3.0.0:clean (default-clean) @ openjpa-features ---
[INFO]
[INFO] --- buildnumber-maven-plugin:1.4:create (default) @ openjpa-features ---
[INFO]
[INFO] --- maven-enforcer-plugin:1.4.1:enforce (default) @ openjpa-features ---
[INFO]
[INFO] --- maven-checkstyle-plugin:2.9:checkstyle (default) @ openjpa-features ---
[INFO]
[INFO] --- maven-remote-resources-plugin:1.5:process (process-resource-bundles) @ openjpa-features ---
[INFO]
[INFO] --- karaf-maven-plugin:4.1.1:features-generate-descriptor (compile) @ openjpa-features ---
[WARNING] Error injecting: org.apache.karaf.tooling.features.GenerateDescriptorMojo
java.lang.TypeNotPresentException: Type org.apache.karaf.tooling.features.GenerateDescriptorMojo not present
        at org.sonatype.guice.bean.reflect.URLClassSpace.loadClass(URLClassSpace.java:109)
        at org.sonatype.guice.bean.reflect.NamedClass.load(NamedClass.java:45)
        at org.sonatype.guice.bean.reflect.AbstractDeferredClass.get(AbstractDeferredClass.java:45)
        at com.google.inject.internal.ProviderInternalFactory.provision(ProviderInternalFactory.java:84)
        at com.google.inject.internal.InternalFactoryToInitializableAdapter.provision(InternalFactoryToInitializableAdapter.java:52)
        at com.google.inject.internal.ProviderInternalFactory$1.call(ProviderInternalFactory.java:70)
        at com.google.inject.internal.ProvisionListenerStackCallback$Provision.provision(ProvisionListenerStackCallback.java:100)
        at org.sonatype.guice.plexus.lifecycles.PlexusLifecycleManager.onProvision(PlexusLifecycleManager.java:138)
        at com.google.inject.internal.ProvisionListenerStackCallback$Provision.provision(ProvisionListenerStackCallback.java:108)
        at com.google.inject.internal.ProvisionListenerStackCallback.provision(ProvisionListenerStackCallback.java:55)
        at com.google.inject.internal.ProviderInternalFactory.circularGet(ProviderInternalFactory.java:68)
        at com.google.inject.internal.InternalFactoryToInitializableAdapter.get(InternalFactoryToInitializableAdapter.java:45)
        at com.google.inject.internal.InjectorImpl$3$1.call(InjectorImpl.java:965)
        at com.google.inject.internal.InjectorImpl.callInContext(InjectorImpl.java:1011)
        at com.google.inject.internal.InjectorImpl$3.get(InjectorImpl.java:961)
        at com.google.inject.Scopes$1$1.get(Scopes.java:59)
        at org.sonatype.guice.bean.locators.LazyBeanEntry.getValue(LazyBeanEntry.java:83)
        at org.sonatype.guice.plexus.locators.LazyPlexusBean.getValue(LazyPlexusBean.java:49)
        at org.codehaus.plexus.DefaultPlexusContainer.lookup(DefaultPlexusContainer.java:253)
        at org.codehaus.plexus.DefaultPlexusContainer.lookup(DefaultPlexusContainer.java:245)
        at org.apache.maven.plugin.internal.DefaultMavenPluginManager.getConfiguredMojo(DefaultMavenPluginManager.java:455)
        at org.apache.maven.plugin.DefaultBuildPluginManager.executeMojo(DefaultBuildPluginManager.java:92)
        at org.apache.maven.lifecycle.internal.MojoExecutor.execute(MojoExecutor.java:209)
        at org.apache.maven.lifecycle.internal.MojoExecutor.execute(MojoExecutor.java:153)
        at org.apache.maven.lifecycle.internal.MojoExecutor.execute(MojoExecutor.java:145)
        at org.apache.maven.lifecycle.internal.LifecycleModuleBuilder.buildProject(LifecycleModuleBuilder.java:84)
        at org.apache.maven.lifecycle.internal.LifecycleModuleBuilder.buildProject(LifecycleModuleBuilder.java:59)
        at org.apache.maven.lifecycle.internal.LifecycleStarter.singleThreadedBuild(LifecycleStarter.java:183)
        at org.apache.maven.lifecycle.internal.LifecycleStarter.execute(LifecycleStarter.java:161)
        at org.apache.maven.DefaultMaven.doExecute(DefaultMaven.java:320)
        at org.apache.maven.DefaultMaven.execute(DefaultMaven.java:156)
        at org.jvnet.hudson.maven3.launcher.Maven3Launcher.main(Maven3Launcher.java:117)
        at sun.reflect.NativeMethodAccessorImpl.invoke0(Native Method)
        at sun.reflect.NativeMethodAccessorImpl.invoke(NativeMethodAccessorImpl.java:57)
        at sun.reflect.DelegatingMethodAccessorImpl.invoke(DelegatingMethodAccessorImpl.java:43)
        at java.lang.reflect.Method.invoke(Method.java:606)
        at org.codehaus.plexus.classworlds.launcher.Launcher.launchStandard(Launcher.java:329)
        at org.codehaus.plexus.classworlds.launcher.Launcher.launch(Launcher.java:239)
        at org.jvnet.hudson.maven3.agent.Maven3Main.launch(Maven3Main.java:181)
        at sun.reflect.NativeMethodAccessorImpl.invoke0(Native Method)
        at sun.reflect.NativeMethodAccessorImpl.invoke(NativeMethodAccessorImpl.java:57)
        at sun.reflect.DelegatingMethodAccessorImpl.invoke(DelegatingMethodAccessorImpl.java:43)
        at java.lang.reflect.Method.invoke(Method.java:606)
        at hudson.maven.Maven3Builder.call(Maven3Builder.java:139)
        at hudson.maven.Maven3Builder.call(Maven3Builder.java:70)
        at hudson.remoting.UserRequest.perform(UserRequest.java:153)
        at hudson.remoting.UserRequest.perform(UserRequest.java:50)
        at hudson.remoting.Request$2.run(Request.java:336)
        at hudson.remoting.InterceptingExecutorService$1.call(InterceptingExecutorService.java:68)
        at java.util.concurrent.FutureTask.run(FutureTask.java:262)
        at java.util.concurrent.ThreadPoolExecutor.runWorker(ThreadPoolExecutor.java:1145)
        at java.util.concurrent.ThreadPoolExecutor$Worker.run(ThreadPoolExecutor.java:615)
        at java.lang.Thread.run(Thread.java:745)
Caused by: java.lang.UnsupportedClassVersionError: org/apache/karaf/tooling/features/GenerateDescriptorMojo : Unsupported major.minor version 52.0
        at java.lang.ClassLoader.defineClass1(Native Method)
        at java.lang.ClassLoader.defineClass(ClassLoader.java:800)
        at java.security.SecureClassLoader.defineClass(SecureClassLoader.java:142)
        at java.net.URLClassLoader.defineClass(URLClassLoader.java:449)
        at java.net.URLClassLoader.access$100(URLClassLoader.java:71)
        at java.net.URLClassLoader$1.run(URLClassLoader.java:361)
        at java.net.URLClassLoader$1.run(URLClassLoader.java:355)
        at java.security.AccessController.doPrivileged(Native Method)
        at java.net.URLClassLoader.findClass(URLClassLoader.java:354)
        at org.codehaus.plexus.classworlds.realm.ClassRealm.loadClassFromSelf(ClassRealm.java:386)
        at org.codehaus.plexus.classworlds.strategy.SelfFirstStrategy.loadClass(SelfFirstStrategy.java:42)
        at org.codehaus.plexus.classworlds.realm.ClassRealm.loadClass(ClassRealm.java:244)
        at org.codehaus.plexus.classworlds.realm.ClassRealm.loadClass(ClassRealm.java:230)
        at org.sonatype.guice.bean.reflect.URLClassSpace.loadClass(URLClassSpace.java:101)
        ... 52 more
java.lang.reflect.InvocationTargetException
        at sun.reflect.NativeMethodAccessorImpl.invoke0(Native Method)
        at sun.reflect.NativeMethodAccessorImpl.invoke(NativeMethodAccessorImpl.java:57)
        at sun.reflect.DelegatingMethodAccessorImpl.invoke(DelegatingMethodAccessorImpl.java:43)
        at java.lang.reflect.Method.invoke(Method.java:606)
        at org.codehaus.plexus.classworlds.launcher.Launcher.launchStandard(Launcher.java:329)
        at org.codehaus.plexus.classworlds.launcher.Launcher.launch(Launcher.java:239)
        at org.jvnet.hudson.maven3.agent.Maven3Main.launch(Maven3Main.java:181)
        at sun.reflect.NativeMethodAccessorImpl.invoke0(Native Method)
        at sun.reflect.NativeMethodAccessorImpl.invoke(NativeMethodAccessorImpl.java:57)
        at sun.reflect.DelegatingMethodAccessorImpl.invoke(DelegatingMethodAccessorImpl.java:43)
        at java.lang.reflect.Method.invoke(Method.java:606)
        at hudson.maven.Maven3Builder.call(Maven3Builder.java:139)
        at hudson.maven.Maven3Builder.call(Maven3Builder.java:70)
        at hudson.remoting.UserRequest.perform(UserRequest.java:153)
        at hudson.remoting.UserRequest.perform(UserRequest.java:50)
        at hudson.remoting.Request$2.run(Request.java:336)
        at hudson.remoting.InterceptingExecutorService$1.call(InterceptingExecutorService.java:68)
        at java.util.concurrent.FutureTask.run(FutureTask.java:262)
        at java.util.concurrent.ThreadPoolExecutor.runWorker(ThreadPoolExecutor.java:1145)
        at java.util.concurrent.ThreadPoolExecutor$Worker.run(ThreadPoolExecutor.java:615)
        at java.lang.Thread.run(Thread.java:745)
Caused by: java.lang.UnsupportedClassVersionError: org/apache/karaf/tooling/features/GenerateDescriptorMojo : Unsupported major.minor version 52.0
        at java.lang.ClassLoader.defineClass1(Native Method)
        at java.lang.ClassLoader.defineClass(ClassLoader.java:800)
        at java.security.SecureClassLoader.defineClass(SecureClassLoader.java:142)
        at java.net.URLClassLoader.defineClass(URLClassLoader.java:449)
        at java.net.URLClassLoader.access$100(URLClassLoader.java:71)
        at java.net.URLClassLoader$1.run(URLClassLoader.java:361)
        at java.net.URLClassLoader$1.run(URLClassLoader.java:355)
        at java.security.AccessController.doPrivileged(Native Method)
        at java.net.URLClassLoader.findClass(URLClassLoader.java:354)
        at org.codehaus.plexus.classworlds.realm.ClassRealm.loadClassFromSelf(ClassRealm.java:386)
        at org.codehaus.plexus.classworlds.strategy.SelfFirstStrategy.loadClass(SelfFirstStrategy.java:42)
        at org.codehaus.plexus.classworlds.realm.ClassRealm.loadClass(ClassRealm.java:244)
        at org.codehaus.plexus.classworlds.realm.ClassRealm.loadClass(ClassRealm.java:230)
        at hudson.maven.ExecutedMojo.getMojoClass(ExecutedMojo.java:126)
        at hudson.maven.ExecutedMojo.<init>(ExecutedMojo.java:99)
        at hudson.maven.Maven3Builder$MavenExecutionListener.recordExecutionTime(Maven3Builder.java:654)
        at hudson.maven.Maven3Builder$MavenExecutionListener.recordMojoEnded(Maven3Builder.java:618)
        at hudson.maven.Maven3Builder$MavenExecutionListener.mojoFailed(Maven3Builder.java:662)
        at org.apache.maven.lifecycle.internal.DefaultExecutionEventCatapult.fire(DefaultExecutionEventCatapult.java:90)
        at org.apache.maven.lifecycle.internal.MojoExecutor.execute(MojoExecutor.java:232)
        at org.apache.maven.lifecycle.internal.MojoExecutor.execute(MojoExecutor.java:153)
        at org.apache.maven.lifecycle.internal.MojoExecutor.execute(MojoExecutor.java:145)
        at org.apache.maven.lifecycle.internal.LifecycleModuleBuilder.buildProject(LifecycleModuleBuilder.java:84)
        at org.apache.maven.lifecycle.internal.LifecycleModuleBuilder.buildProject(LifecycleModuleBuilder.java:59)
        at org.apache.maven.lifecycle.internal.LifecycleStarter.singleThreadedBuild(LifecycleStarter.java:183)
        at org.apache.maven.lifecycle.internal.LifecycleStarter.execute(LifecycleStarter.java:161)
        at org.apache.maven.DefaultMaven.doExecute(DefaultMaven.java:320)
        at org.apache.maven.DefaultMaven.execute(DefaultMaven.java:156)
        at org.jvnet.hudson.maven3.launcher.Maven3Launcher.main(Maven3Launcher.java:117)
        ... 21 more
ERROR: Failed to parse POMs
java.io.IOException: java.lang.reflect.InvocationTargetException
        at hudson.maven.Maven3Builder.call(Maven3Builder.java:179)
        at hudson.maven.Maven3Builder.call(Maven3Builder.java:70)
        at hudson.remoting.UserRequest.perform(UserRequest.java:153)
        at hudson.remoting.UserRequest.perform(UserRequest.java:50)
        at hudson.remoting.Request$2.run(Request.java:336)
        at hudson.remoting.InterceptingExecutorService$1.call(InterceptingExecutorService.java:68)
        at java.util.concurrent.FutureTask.run(FutureTask.java:262)
        at java.util.concurrent.ThreadPoolExecutor.runWorker(ThreadPoolExecutor.java:1145)
        at java.util.concurrent.ThreadPoolExecutor$Worker.run(ThreadPoolExecutor.java:615)
        at java.lang.Thread.run(Thread.java:745)
        at ......remote call to Channel to Maven [/home/jenkins/tools/java/latest1.7/bin/java, -Xmx1280m, -XX:MaxPermSize=512m, -cp, /home/jenkins/jenkins-slave/maven3-agent.jar:/home/jenkins/tools/maven/apache-maven-3.0.4/boot/plexus-classworlds-2.4.jar, org.jvnet.hudson.maven3.agent.Maven3Main, /home/jenkins/tools/maven/apache-maven-3.0.4, /home/jenkins/jenkins-slave/slave.jar, /home/jenkins/jenkins-slave/maven3-interceptor.jar, /home/jenkins/jenkins-slave/maven3-interceptor-commons.jar, 37443](Native Method)
        at hudson.remoting.Channel.attachCallSiteStackTrace(Channel.java:1545)
        at hudson.remoting.UserResponse.retrieve(UserRequest.java:253)
        at hudson.remoting.Channel.call(Channel.java:830)
        at hudson.maven.ProcessCache$MavenProcess.call(ProcessCache.java:161)
        at hudson.maven.MavenModuleSetBuild$MavenModuleSetBuildExecution.doRun(MavenModuleSetBuild.java:873)
        at hudson.model.AbstractBuild$AbstractBuildExecution.run(AbstractBuild.java:534)
        at hudson.model.Run.execute(Run.java:1728)
        at hudson.maven.MavenModuleSetBuild.run(MavenModuleSetBuild.java:544)
        at hudson.model.ResourceController.execute(ResourceController.java:98)
        at hudson.model.Executor.run(Executor.java:405)
Caused by: java.lang.reflect.InvocationTargetException
        at sun.reflect.NativeMethodAccessorImpl.invoke0(Native Method)
        at sun.reflect.NativeMethodAccessorImpl.invoke(NativeMethodAccessorImpl.java:57)
        at sun.reflect.DelegatingMethodAccessorImpl.invoke(DelegatingMethodAccessorImpl.java:43)
        at java.lang.reflect.Method.invoke(Method.java:606)
        at hudson.maven.Maven3Builder.call(Maven3Builder.java:139)
        at hudson.maven.Maven3Builder.call(Maven3Builder.java:70)
        at hudson.remoting.UserRequest.perform(UserRequest.java:153)
        at hudson.remoting.UserRequest.perform(UserRequest.java:50)
        at hudson.remoting.Request$2.run(Request.java:336)
        at hudson.remoting.InterceptingExecutorService$1.call(InterceptingExecutorService.java:68)
        at java.util.concurrent.FutureTask.run(FutureTask.java:262)
        at java.util.concurrent.ThreadPoolExecutor.runWorker(ThreadPoolExecutor.java:1145)
        at java.util.concurrent.ThreadPoolExecutor$Worker.run(ThreadPoolExecutor.java:615)
        at java.lang.Thread.run(Thread.java:745)
Caused by: java.lang.Exception: java.lang.reflect.InvocationTargetException
        at org.jvnet.hudson.maven3.agent.Maven3Main.launch(Maven3Main.java:184)
        ... 14 more
Caused by: java.lang.reflect.InvocationTargetException
        at sun.reflect.NativeMethodAccessorImpl.invoke0(Native Method)
        at sun.reflect.NativeMethodAccessorImpl.invoke(NativeMethodAccessorImpl.java:57)
        at sun.reflect.DelegatingMethodAccessorImpl.invoke(DelegatingMethodAccessorImpl.java:43)
        at java.lang.reflect.Method.invoke(Method.java:606)
        at org.codehaus.plexus.classworlds.launcher.Launcher.launchStandard(Launcher.java:329)
        at org.codehaus.plexus.classworlds.launcher.Launcher.launch(Launcher.java:239)
        at org.jvnet.hudson.maven3.agent.Maven3Main.launch(Maven3Main.java:181)
        ... 14 more
Caused by: java.lang.UnsupportedClassVersionError: org/apache/karaf/tooling/features/GenerateDescriptorMojo : Unsupported major.minor version 52.0
        at java.lang.ClassLoader.defineClass1(Native Method)
        at java.lang.ClassLoader.defineClass(ClassLoader.java:800)
        at java.security.SecureClassLoader.defineClass(SecureClassLoader.java:142)
        at java.net.URLClassLoader.defineClass(URLClassLoader.java:449)
        at java.net.URLClassLoader.access$100(URLClassLoader.java:71)
        at java.net.URLClassLoader$1.run(URLClassLoader.java:361)
        at java.net.URLClassLoader$1.run(URLClassLoader.java:355)
        at java.security.AccessController.doPrivileged(Native Method)
        at java.net.URLClassLoader.findClass(URLClassLoader.java:354)
        at org.codehaus.plexus.classworlds.realm.ClassRealm.loadClassFromSelf(ClassRealm.java:386)
        at org.codehaus.plexus.classworlds.strategy.SelfFirstStrategy.loadClass(SelfFirstStrategy.java:42)
        at org.codehaus.plexus.classworlds.realm.ClassRealm.loadClass(ClassRealm.java:244)
        at org.codehaus.plexus.classworlds.realm.ClassRealm.loadClass(ClassRealm.java:230)
        at hudson.maven.ExecutedMojo.getMojoClass(ExecutedMojo.java:126)
        at hudson.maven.ExecutedMojo.<init>(ExecutedMojo.java:99)
        at hudson.maven.Maven3Builder$MavenExecutionListener.recordExecutionTime(Maven3Builder.java:654)
        at hudson.maven.Maven3Builder$MavenExecutionListener.recordMojoEnded(Maven3Builder.java:618)
        at hudson.maven.Maven3Builder$MavenExecutionListener.mojoFailed(Maven3Builder.java:662)
        at org.apache.maven.lifecycle.internal.DefaultExecutionEventCatapult.fire(DefaultExecutionEventCatapult.java:90)
        at org.apache.maven.lifecycle.internal.MojoExecutor.execute(MojoExecutor.java:232)
        at org.apache.maven.lifecycle.internal.MojoExecutor.execute(MojoExecutor.java:153)
        at org.apache.maven.lifecycle.internal.MojoExecutor.execute(MojoExecutor.java:145)
        at org.apache.maven.lifecycle.internal.LifecycleModuleBuilder.buildProject(LifecycleModuleBuilder.java:84)
        at org.apache.maven.lifecycle.internal.LifecycleModuleBuilder.buildProject(LifecycleModuleBuilder.java:59)
        at org.apache.maven.lifecycle.internal.LifecycleStarter.singleThreadedBuild(LifecycleStarter.java:183)
        at org.apache.maven.lifecycle.internal.LifecycleStarter.execute(LifecycleStarter.java:161)
        at org.apache.maven.DefaultMaven.doExecute(DefaultMaven.java:320)
        at org.apache.maven.DefaultMaven.execute(DefaultMaven.java:156)
        at org.jvnet.hudson.maven3.launcher.Maven3Launcher.main(Maven3Launcher.java:117)
        ... 21 more
channel stopped
Reply | Threaded
Open this post in threaded view
|  
Report Content as Inappropriate

Build failed in Jenkins: OpenJPA-trunk-deploy #550

Apache Jenkins Server-2
See <https://builds.apache.org/job/OpenJPA-trunk-deploy/550/display/redirect?page=changes>

Changes:

[jgrassel] OPENJPA-2705: ArrayOutOfBoundsException occurs with an @EmbeddedId (commit on wdazeys behalf)

------------------------------------------
[...truncated 1.71 MB...]
Uploading: https://repository.apache.org/content/repositories/snapshots/org/apache/openjpa/openjpa-tools/maven-metadata.xml
Uploaded: https://repository.apache.org/content/repositories/snapshots/org/apache/openjpa/openjpa-tools/maven-metadata.xml (473 B at 0.6 KB/sec)
[INFO]                                                                        
[INFO] ------------------------------------------------------------------------
[INFO] Building OpenJPA Maven Plugin 3.0.0-SNAPSHOT
[INFO] ------------------------------------------------------------------------
[INFO]
[INFO] --- maven-clean-plugin:3.0.0:clean (default-clean) @ openjpa-maven-plugin ---
[INFO]
[INFO] --- buildnumber-maven-plugin:1.4:create (default) @ openjpa-maven-plugin ---
[INFO]
[INFO] --- maven-enforcer-plugin:1.4.1:enforce (default) @ openjpa-maven-plugin ---
[INFO]
[INFO] --- maven-plugin-plugin:3.4:helpmojo (help-goal) @ openjpa-maven-plugin ---
[INFO] Using 'UTF-8' encoding to read mojo metadata.
[INFO] Mojo extractor with id: java-javadoc found 0 mojo descriptors.
[INFO] Mojo extractor with id: java-annotations found 0 mojo descriptors.
[INFO]
[INFO] --- maven-checkstyle-plugin:2.9:checkstyle (default) @ openjpa-maven-plugin ---
[INFO] Starting audit...
Audit done.

[WARNING] Unable to locate Source XRef to link to - DISABLED
[INFO]
[INFO] --- maven-plugin-plugin:3.4:descriptor (default-descriptor) @ openjpa-maven-plugin ---
[INFO] Using 'UTF-8' encoding to read mojo metadata.
[INFO] Mojo extractor with id: java-javadoc found 0 mojo descriptors.
[INFO] Mojo extractor with id: java-annotations found 0 mojo descriptors.
[INFO]
[INFO] --- maven-remote-resources-plugin:1.5:process (process-resource-bundles) @ openjpa-maven-plugin ---
[INFO]
[INFO] --- maven-resources-plugin:2.7:resources (default-resources) @ openjpa-maven-plugin ---
[INFO] Using 'UTF-8' encoding to copy filtered resources.
[INFO] skip non existing resourceDirectory <https://builds.apache.org/job/OpenJPA-trunk-deploy/ws/trunk/openjpa-tools/openjpa-maven-plugin/src/main/resources>
[INFO] Copying 3 resources
[INFO]
[INFO] --- maven-compiler-plugin:3.5.1:compile (default-compile) @ openjpa-maven-plugin ---
[INFO] Changes detected - recompiling the module!
[INFO] Compiling 8 source files to <https://builds.apache.org/job/OpenJPA-trunk-deploy/ws/trunk/openjpa-tools/openjpa-maven-plugin/target/classes>
[INFO]
[INFO] --- maven-plugin-plugin:3.4:descriptor (mojo-descriptor) @ openjpa-maven-plugin ---
[INFO] Using 'UTF-8' encoding to read mojo metadata.
[INFO] Mojo extractor with id: java-javadoc found 0 mojo descriptors.
[INFO] Mojo extractor with id: java-annotations found 5 mojo descriptors.
[INFO]
[INFO] --- maven-compiler-plugin:3.5.1:testCompile (test-source-compile) @ openjpa-maven-plugin ---
[INFO] Changes detected - recompiling the module!
[INFO] Compiling 3 source files to <https://builds.apache.org/job/OpenJPA-trunk-deploy/ws/trunk/openjpa-tools/openjpa-maven-plugin/target/test-classes>
[INFO]
[INFO] --- maven-resources-plugin:2.7:testResources (default-testResources) @ openjpa-maven-plugin ---
[INFO] Using 'UTF-8' encoding to copy filtered resources.
[INFO] Copying 4 resources
[INFO] Copying 3 resources
[INFO]
[INFO] --- maven-compiler-plugin:3.5.1:testCompile (default-testCompile) @ openjpa-maven-plugin ---
[INFO] Changes detected - recompiling the module!
[INFO] Compiling 3 source files to <https://builds.apache.org/job/OpenJPA-trunk-deploy/ws/trunk/openjpa-tools/openjpa-maven-plugin/target/test-classes>
[INFO]
[INFO] --- maven-surefire-plugin:2.19.1:test (default-test) @ openjpa-maven-plugin ---

-------------------------------------------------------
 T E S T S
-------------------------------------------------------
Running org.apache.openjpa.tools.maven.OpenJpaEnhancerMojoTest
Tests run: 1, Failures: 0, Errors: 0, Skipped: 0, Time elapsed: 1.093 sec - in org.apache.openjpa.tools.maven.OpenJpaEnhancerMojoTest

Results :

Tests run: 1, Failures: 0, Errors: 0, Skipped: 0

[JENKINS] Recording test results
[INFO]
[INFO] --- maven-jar-plugin:3.0.2:jar (default-jar) @ openjpa-maven-plugin ---
[INFO] Building jar: <https://builds.apache.org/job/OpenJPA-trunk-deploy/ws/trunk/openjpa-tools/openjpa-maven-plugin/target/openjpa-maven-plugin-3.0.0-SNAPSHOT.jar>
[INFO]
[INFO] --- maven-plugin-plugin:3.4:addPluginArtifactMetadata (default-addPluginArtifactMetadata) @ openjpa-maven-plugin ---
[INFO]
[INFO] --- maven-site-plugin:3.5.1:attach-descriptor (attach-descriptor) @ openjpa-maven-plugin ---
[INFO]
[INFO] --- maven-jar-plugin:3.0.2:test-jar (attach-tests) @ openjpa-maven-plugin ---
[INFO] Building jar: <https://builds.apache.org/job/OpenJPA-trunk-deploy/ws/trunk/openjpa-tools/openjpa-maven-plugin/target/openjpa-maven-plugin-3.0.0-SNAPSHOT-tests.jar>
[INFO]
[INFO] --- maven-invoker-plugin:2.0.0:install (integration-test) @ openjpa-maven-plugin ---
[INFO] Installing <https://builds.apache.org/job/OpenJPA-trunk-deploy/ws/trunk/pom.xml> to <https://builds.apache.org/job/OpenJPA-trunk-deploy/ws/trunk/openjpa-tools/openjpa-maven-plugin/target/local-repo/org/apache/openjpa/openjpa-parent/3.0.0-SNAPSHOT/openjpa-parent-3.0.0-SNAPSHOT.pom>
[INFO] Installing <https://builds.apache.org/job/OpenJPA-trunk-deploy/ws/trunk/target/openjpa-parent-3.0.0-SNAPSHOT-site.xml> to <https://builds.apache.org/job/OpenJPA-trunk-deploy/ws/trunk/openjpa-tools/openjpa-maven-plugin/target/local-repo/org/apache/openjpa/openjpa-parent/3.0.0-SNAPSHOT/openjpa-parent-3.0.0-SNAPSHOT-site.xml>
[INFO] Installing <https://builds.apache.org/job/OpenJPA-trunk-deploy/ws/trunk/openjpa-lib/pom.xml> to <https://builds.apache.org/job/OpenJPA-trunk-deploy/ws/trunk/openjpa-tools/openjpa-maven-plugin/target/local-repo/org/apache/openjpa/openjpa-lib/3.0.0-SNAPSHOT/openjpa-lib-3.0.0-SNAPSHOT.pom>
[INFO] Installing <https://builds.apache.org/job/OpenJPA-trunk-deploy/ws/trunk/openjpa-lib/target/openjpa-lib-3.0.0-SNAPSHOT.jar> to <https://builds.apache.org/job/OpenJPA-trunk-deploy/ws/trunk/openjpa-tools/openjpa-maven-plugin/target/local-repo/org/apache/openjpa/openjpa-lib/3.0.0-SNAPSHOT/openjpa-lib-3.0.0-SNAPSHOT.jar>
[INFO] Installing <https://builds.apache.org/job/OpenJPA-trunk-deploy/ws/trunk/openjpa-lib/pom.xml> to <https://builds.apache.org/job/OpenJPA-trunk-deploy/ws/trunk/openjpa-tools/openjpa-maven-plugin/target/local-repo/org/apache/openjpa/openjpa-lib/3.0.0-SNAPSHOT/openjpa-lib-3.0.0-SNAPSHOT.pom>
[INFO] Installing <https://builds.apache.org/job/OpenJPA-trunk-deploy/ws/trunk/openjpa-lib/target/openjpa-lib-3.0.0-SNAPSHOT-tests.jar> to <https://builds.apache.org/job/OpenJPA-trunk-deploy/ws/trunk/openjpa-tools/openjpa-maven-plugin/target/local-repo/org/apache/openjpa/openjpa-lib/3.0.0-SNAPSHOT/openjpa-lib-3.0.0-SNAPSHOT-tests.jar>
[INFO] Installing <https://builds.apache.org/job/OpenJPA-trunk-deploy/ws/trunk/openjpa-kernel/pom.xml> to <https://builds.apache.org/job/OpenJPA-trunk-deploy/ws/trunk/openjpa-tools/openjpa-maven-plugin/target/local-repo/org/apache/openjpa/openjpa-kernel/3.0.0-SNAPSHOT/openjpa-kernel-3.0.0-SNAPSHOT.pom>
[INFO] Installing <https://builds.apache.org/job/OpenJPA-trunk-deploy/ws/trunk/openjpa-kernel/target/openjpa-kernel-3.0.0-SNAPSHOT.jar> to <https://builds.apache.org/job/OpenJPA-trunk-deploy/ws/trunk/openjpa-tools/openjpa-maven-plugin/target/local-repo/org/apache/openjpa/openjpa-kernel/3.0.0-SNAPSHOT/openjpa-kernel-3.0.0-SNAPSHOT.jar>
[INFO] Installing <https://builds.apache.org/job/OpenJPA-trunk-deploy/ws/trunk/openjpa-kernel/pom.xml> to <https://builds.apache.org/job/OpenJPA-trunk-deploy/ws/trunk/openjpa-tools/openjpa-maven-plugin/target/local-repo/org/apache/openjpa/openjpa-kernel/3.0.0-SNAPSHOT/openjpa-kernel-3.0.0-SNAPSHOT.pom>
[INFO] Installing <https://builds.apache.org/job/OpenJPA-trunk-deploy/ws/trunk/openjpa-kernel/target/openjpa-kernel-3.0.0-SNAPSHOT-tests.jar> to <https://builds.apache.org/job/OpenJPA-trunk-deploy/ws/trunk/openjpa-tools/openjpa-maven-plugin/target/local-repo/org/apache/openjpa/openjpa-kernel/3.0.0-SNAPSHOT/openjpa-kernel-3.0.0-SNAPSHOT-tests.jar>
[INFO] Installing <https://builds.apache.org/job/OpenJPA-trunk-deploy/ws/trunk/openjpa-jdbc/pom.xml> to <https://builds.apache.org/job/OpenJPA-trunk-deploy/ws/trunk/openjpa-tools/openjpa-maven-plugin/target/local-repo/org/apache/openjpa/openjpa-jdbc/3.0.0-SNAPSHOT/openjpa-jdbc-3.0.0-SNAPSHOT.pom>
[INFO] Installing <https://builds.apache.org/job/OpenJPA-trunk-deploy/ws/trunk/openjpa-jdbc/target/openjpa-jdbc-3.0.0-SNAPSHOT.jar> to <https://builds.apache.org/job/OpenJPA-trunk-deploy/ws/trunk/openjpa-tools/openjpa-maven-plugin/target/local-repo/org/apache/openjpa/openjpa-jdbc/3.0.0-SNAPSHOT/openjpa-jdbc-3.0.0-SNAPSHOT.jar>
[INFO] Installing <https://builds.apache.org/job/OpenJPA-trunk-deploy/ws/trunk/openjpa-jdbc/pom.xml> to <https://builds.apache.org/job/OpenJPA-trunk-deploy/ws/trunk/openjpa-tools/openjpa-maven-plugin/target/local-repo/org/apache/openjpa/openjpa-jdbc/3.0.0-SNAPSHOT/openjpa-jdbc-3.0.0-SNAPSHOT.pom>
[INFO] Installing <https://builds.apache.org/job/OpenJPA-trunk-deploy/ws/trunk/openjpa-jdbc/target/openjpa-jdbc-3.0.0-SNAPSHOT-tests.jar> to <https://builds.apache.org/job/OpenJPA-trunk-deploy/ws/trunk/openjpa-tools/openjpa-maven-plugin/target/local-repo/org/apache/openjpa/openjpa-jdbc/3.0.0-SNAPSHOT/openjpa-jdbc-3.0.0-SNAPSHOT-tests.jar>
[INFO] Installing <https://builds.apache.org/job/OpenJPA-trunk-deploy/ws/trunk/openjpa-persistence/pom.xml> to <https://builds.apache.org/job/OpenJPA-trunk-deploy/ws/trunk/openjpa-tools/openjpa-maven-plugin/target/local-repo/org/apache/openjpa/openjpa-persistence/3.0.0-SNAPSHOT/openjpa-persistence-3.0.0-SNAPSHOT.pom>
[INFO] Installing <https://builds.apache.org/job/OpenJPA-trunk-deploy/ws/trunk/openjpa-persistence/target/openjpa-persistence-3.0.0-SNAPSHOT.jar> to <https://builds.apache.org/job/OpenJPA-trunk-deploy/ws/trunk/openjpa-tools/openjpa-maven-plugin/target/local-repo/org/apache/openjpa/openjpa-persistence/3.0.0-SNAPSHOT/openjpa-persistence-3.0.0-SNAPSHOT.jar>
[INFO] Installing <https://builds.apache.org/job/OpenJPA-trunk-deploy/ws/trunk/openjpa-persistence/pom.xml> to <https://builds.apache.org/job/OpenJPA-trunk-deploy/ws/trunk/openjpa-tools/openjpa-maven-plugin/target/local-repo/org/apache/openjpa/openjpa-persistence/3.0.0-SNAPSHOT/openjpa-persistence-3.0.0-SNAPSHOT.pom>
[INFO] Installing <https://builds.apache.org/job/OpenJPA-trunk-deploy/ws/trunk/openjpa-persistence/target/openjpa-persistence-3.0.0-SNAPSHOT-tests.jar> to <https://builds.apache.org/job/OpenJPA-trunk-deploy/ws/trunk/openjpa-tools/openjpa-maven-plugin/target/local-repo/org/apache/openjpa/openjpa-persistence/3.0.0-SNAPSHOT/openjpa-persistence-3.0.0-SNAPSHOT-tests.jar>
[INFO] Installing <https://builds.apache.org/job/OpenJPA-trunk-deploy/ws/trunk/openjpa-persistence-jdbc/pom.xml> to <https://builds.apache.org/job/OpenJPA-trunk-deploy/ws/trunk/openjpa-tools/openjpa-maven-plugin/target/local-repo/org/apache/openjpa/openjpa-persistence-jdbc/3.0.0-SNAPSHOT/openjpa-persistence-jdbc-3.0.0-SNAPSHOT.pom>
[INFO] Installing <https://builds.apache.org/job/OpenJPA-trunk-deploy/ws/trunk/openjpa-persistence-jdbc/target/openjpa-persistence-jdbc-3.0.0-SNAPSHOT.jar> to <https://builds.apache.org/job/OpenJPA-trunk-deploy/ws/trunk/openjpa-tools/openjpa-maven-plugin/target/local-repo/org/apache/openjpa/openjpa-persistence-jdbc/3.0.0-SNAPSHOT/openjpa-persistence-jdbc-3.0.0-SNAPSHOT.jar>
[INFO] Installing <https://builds.apache.org/job/OpenJPA-trunk-deploy/ws/trunk/openjpa-persistence-jdbc/pom.xml> to <https://builds.apache.org/job/OpenJPA-trunk-deploy/ws/trunk/openjpa-tools/openjpa-maven-plugin/target/local-repo/org/apache/openjpa/openjpa-persistence-jdbc/3.0.0-SNAPSHOT/openjpa-persistence-jdbc-3.0.0-SNAPSHOT.pom>
[INFO] Installing <https://builds.apache.org/job/OpenJPA-trunk-deploy/ws/trunk/openjpa-persistence-jdbc/target/openjpa-persistence-jdbc-3.0.0-SNAPSHOT-tests.jar> to <https://builds.apache.org/job/OpenJPA-trunk-deploy/ws/trunk/openjpa-tools/openjpa-maven-plugin/target/local-repo/org/apache/openjpa/openjpa-persistence-jdbc/3.0.0-SNAPSHOT/openjpa-persistence-jdbc-3.0.0-SNAPSHOT-tests.jar>
[INFO] Installing <https://builds.apache.org/job/OpenJPA-trunk-deploy/ws/trunk/openjpa-persistence-locking/pom.xml> to <https://builds.apache.org/job/OpenJPA-trunk-deploy/ws/trunk/openjpa-tools/openjpa-maven-plugin/target/local-repo/org/apache/openjpa/openjpa-persistence-locking/3.0.0-SNAPSHOT/openjpa-persistence-locking-3.0.0-SNAPSHOT.pom>
[INFO] Installing <https://builds.apache.org/job/OpenJPA-trunk-deploy/ws/trunk/openjpa-persistence-locking/target/openjpa-persistence-locking-3.0.0-SNAPSHOT.jar> to <https://builds.apache.org/job/OpenJPA-trunk-deploy/ws/trunk/openjpa-tools/openjpa-maven-plugin/target/local-repo/org/apache/openjpa/openjpa-persistence-locking/3.0.0-SNAPSHOT/openjpa-persistence-locking-3.0.0-SNAPSHOT.jar>
[INFO] Installing <https://builds.apache.org/job/OpenJPA-trunk-deploy/ws/trunk/openjpa-persistence-locking/pom.xml> to <https://builds.apache.org/job/OpenJPA-trunk-deploy/ws/trunk/openjpa-tools/openjpa-maven-plugin/target/local-repo/org/apache/openjpa/openjpa-persistence-locking/3.0.0-SNAPSHOT/openjpa-persistence-locking-3.0.0-SNAPSHOT.pom>
[INFO] Installing <https://builds.apache.org/job/OpenJPA-trunk-deploy/ws/trunk/openjpa-persistence-locking/target/openjpa-persistence-locking-3.0.0-SNAPSHOT-tests.jar> to <https://builds.apache.org/job/OpenJPA-trunk-deploy/ws/trunk/openjpa-tools/openjpa-maven-plugin/target/local-repo/org/apache/openjpa/openjpa-persistence-locking/3.0.0-SNAPSHOT/openjpa-persistence-locking-3.0.0-SNAPSHOT-tests.jar>
[INFO] Installing <https://builds.apache.org/job/OpenJPA-trunk-deploy/ws/trunk/openjpa-tools/pom.xml> to <https://builds.apache.org/job/OpenJPA-trunk-deploy/ws/trunk/openjpa-tools/openjpa-maven-plugin/target/local-repo/org/apache/openjpa/openjpa-tools/3.0.0-SNAPSHOT/openjpa-tools-3.0.0-SNAPSHOT.pom>
[INFO] Installing <https://builds.apache.org/job/OpenJPA-trunk-deploy/ws/trunk/openjpa-tools/openjpa-maven-plugin/pom.xml> to <https://builds.apache.org/job/OpenJPA-trunk-deploy/ws/trunk/openjpa-tools/openjpa-maven-plugin/target/local-repo/org/apache/openjpa/openjpa-maven-plugin/3.0.0-SNAPSHOT/openjpa-maven-plugin-3.0.0-SNAPSHOT.pom>
[INFO] Installing <https://builds.apache.org/job/OpenJPA-trunk-deploy/ws/trunk/openjpa-tools/openjpa-maven-plugin/target/openjpa-maven-plugin-3.0.0-SNAPSHOT.jar> to <https://builds.apache.org/job/OpenJPA-trunk-deploy/ws/trunk/openjpa-tools/openjpa-maven-plugin/target/local-repo/org/apache/openjpa/openjpa-maven-plugin/3.0.0-SNAPSHOT/openjpa-maven-plugin-3.0.0-SNAPSHOT.jar>
[INFO] Installing <https://builds.apache.org/job/OpenJPA-trunk-deploy/ws/trunk/openjpa-tools/openjpa-maven-plugin/target/openjpa-maven-plugin-3.0.0-SNAPSHOT-tests.jar> to <https://builds.apache.org/job/OpenJPA-trunk-deploy/ws/trunk/openjpa-tools/openjpa-maven-plugin/target/local-repo/org/apache/openjpa/openjpa-maven-plugin/3.0.0-SNAPSHOT/openjpa-maven-plugin-3.0.0-SNAPSHOT-tests.jar>
[INFO]
[INFO] --- maven-invoker-plugin:2.0.0:run (integration-test) @ openjpa-maven-plugin ---
[INFO] Building: default_settings/pom.xml
[INFO] ..SUCCESS (17.2 s)
[INFO] Building: nonDefaultPersistenceXml/pom.xml
[INFO] ..SUCCESS (9.1 s)
[INFO] Building: testDependencies/pom.xml
[INFO] ..SUCCESS (10.0 s)
[INFO] Building: sqlActionDropSchema/pom.xml
[INFO] ..SUCCESS (9.7 s)
[INFO] Building: dependingArtifact/pom.xml
[INFO] ..SUCCESS (8.7 s)
[INFO] Building: enhanceIncludesExcludes/pom.xml
[INFO] run script verify.groovy
[INFO] ..SUCCESS (8.2 s)
[INFO] -------------------------------------------------
[INFO] Build Summary:
[INFO]   Passed: 6, Failed: 0, Errors: 0, Skipped: 0
[INFO] -------------------------------------------------
MavenInvokerArchiver
found reports:[<https://builds.apache.org/job/OpenJPA-trunk-deploy/ws/trunk/openjpa-tools/openjpa-maven-plugin/target/invoker-reports/BUILD-default_settings.xml,> <https://builds.apache.org/job/OpenJPA-trunk-deploy/ws/trunk/openjpa-tools/openjpa-maven-plugin/target/invoker-reports/BUILD-sqlActionDropSchema.xml,> <https://builds.apache.org/job/OpenJPA-trunk-deploy/ws/trunk/openjpa-tools/openjpa-maven-plugin/target/invoker-reports/BUILD-testDependencies.xml,> <https://builds.apache.org/job/OpenJPA-trunk-deploy/ws/trunk/openjpa-tools/openjpa-maven-plugin/target/invoker-reports/BUILD-enhanceIncludesExcludes.xml,> <https://builds.apache.org/job/OpenJPA-trunk-deploy/ws/trunk/openjpa-tools/openjpa-maven-plugin/target/invoker-reports/BUILD-nonDefaultPersistenceXml.xml,> <https://builds.apache.org/job/OpenJPA-trunk-deploy/ws/trunk/openjpa-tools/openjpa-maven-plugin/target/invoker-reports/BUILD-dependingArtifact.xml]>
java.lang.reflect.InvocationTargetException
        at sun.reflect.NativeMethodAccessorImpl.invoke0(Native Method)
        at sun.reflect.NativeMethodAccessorImpl.invoke(NativeMethodAccessorImpl.java:62)
        at sun.reflect.DelegatingMethodAccessorImpl.invoke(DelegatingMethodAccessorImpl.java:43)
        at java.lang.reflect.Method.invoke(Method.java:498)
        at org.codehaus.plexus.classworlds.launcher.Launcher.launchStandard(Launcher.java:329)
        at org.codehaus.plexus.classworlds.launcher.Launcher.launch(Launcher.java:239)
        at org.jvnet.hudson.maven3.agent.Maven3Main.launch(Maven3Main.java:181)
        at sun.reflect.NativeMethodAccessorImpl.invoke0(Native Method)
        at sun.reflect.NativeMethodAccessorImpl.invoke(NativeMethodAccessorImpl.java:62)
        at sun.reflect.DelegatingMethodAccessorImpl.invoke(DelegatingMethodAccessorImpl.java:43)
        at java.lang.reflect.Method.invoke(Method.java:498)
        at hudson.maven.Maven3Builder.call(Maven3Builder.java:139)
        at hudson.maven.Maven3Builder.call(Maven3Builder.java:70)
        at hudson.remoting.UserRequest.perform(UserRequest.java:153)
        at hudson.remoting.UserRequest.perform(UserRequest.java:50)
        at hudson.remoting.Request$2.run(Request.java:336)
        at hudson.remoting.InterceptingExecutorService$1.call(InterceptingExecutorService.java:68)
        at java.util.concurrent.FutureTask.run(FutureTask.java:266)
        at java.util.concurrent.ThreadPoolExecutor.runWorker(ThreadPoolExecutor.java:1142)
        at java.util.concurrent.ThreadPoolExecutor$Worker.run(ThreadPoolExecutor.java:617)
        at java.lang.Thread.run(Thread.java:748)
Caused by: java.lang.NoSuchMethodError: org.codehaus.plexus.util.xml.pull.MXParser.<init>(Lorg/codehaus/plexus/util/xml/pull/EntityReplacementMap;)V
        at org.apache.maven.plugin.invoker.model.io.xpp3.BuildJobXpp3Reader.read(BuildJobXpp3Reader.java:510)
        at org.apache.maven.plugin.invoker.model.io.xpp3.BuildJobXpp3Reader.read(BuildJobXpp3Reader.java:529)
        at org.apache.maven.plugin.invoker.model.io.xpp3.BuildJobXpp3Reader.read(BuildJobXpp3Reader.java:558)
        at org.jenkinsci.plugins.maveninvoker.MavenInvokerArchiver.postExecute(MavenInvokerArchiver.java:113)
        at hudson.maven.Maven3Builder$MavenExecutionListener.recordMojoEnded(Maven3Builder.java:629)
        at hudson.maven.Maven3Builder$MavenExecutionListener.mojoSucceeded(Maven3Builder.java:610)
        at org.apache.maven.lifecycle.internal.DefaultExecutionEventCatapult.fire(DefaultExecutionEventCatapult.java:87)
        at org.apache.maven.lifecycle.internal.DefaultExecutionEventCatapult.fire(DefaultExecutionEventCatapult.java:42)
        at org.apache.maven.lifecycle.internal.MojoExecutor.execute(MojoExecutor.java:228)
        at org.apache.maven.lifecycle.internal.MojoExecutor.execute(MojoExecutor.java:153)
        at org.apache.maven.lifecycle.internal.MojoExecutor.execute(MojoExecutor.java:145)
        at org.apache.maven.lifecycle.internal.LifecycleModuleBuilder.buildProject(LifecycleModuleBuilder.java:84)
        at org.apache.maven.lifecycle.internal.LifecycleModuleBuilder.buildProject(LifecycleModuleBuilder.java:59)
        at org.apache.maven.lifecycle.internal.LifecycleStarter.singleThreadedBuild(LifecycleStarter.java:183)
        at org.apache.maven.lifecycle.internal.LifecycleStarter.execute(LifecycleStarter.java:161)
        at org.apache.maven.DefaultMaven.doExecute(DefaultMaven.java:320)
        at org.apache.maven.DefaultMaven.execute(DefaultMaven.java:156)
        at org.jvnet.hudson.maven3.launcher.Maven3Launcher.main(Maven3Launcher.java:117)
        ... 21 more
Sending e-mails to: [hidden email]
Sending e-mails to: [hidden email]
ERROR: Failed to parse POMs
java.io.IOException: java.lang.reflect.InvocationTargetException
        at hudson.maven.Maven3Builder.call(Maven3Builder.java:179)
        at hudson.maven.Maven3Builder.call(Maven3Builder.java:70)
        at hudson.remoting.UserRequest.perform(UserRequest.java:153)
        at hudson.remoting.UserRequest.perform(UserRequest.java:50)
        at hudson.remoting.Request$2.run(Request.java:336)
        at hudson.remoting.InterceptingExecutorService$1.call(InterceptingExecutorService.java:68)
        at java.util.concurrent.FutureTask.run(FutureTask.java:266)
        at java.util.concurrent.ThreadPoolExecutor.runWorker(ThreadPoolExecutor.java:1142)
        at java.util.concurrent.ThreadPoolExecutor$Worker.run(ThreadPoolExecutor.java:617)
        at java.lang.Thread.run(Thread.java:748)
        at ......remote call to Channel to Maven [/usr/local/asfpackages/java/jdk1.8.0_131/jre/bin/java, -Xmx1280m, -XX:MaxPermSize=512m, -cp, /home/jenkins/jenkins-slave/maven3-agent.jar:/home/jenkins/tools/maven/apache-maven-3.0.4/boot/plexus-classworlds-2.4.jar, org.jvnet.hudson.maven3.agent.Maven3Main, /home/jenkins/tools/maven/apache-maven-3.0.4, /home/jenkins/jenkins-slave/slave.jar, /home/jenkins/jenkins-slave/maven3-interceptor.jar, /home/jenkins/jenkins-slave/maven3-interceptor-commons.jar, 34616](Native Method)
        at hudson.remoting.Channel.attachCallSiteStackTrace(Channel.java:1545)
        at hudson.remoting.UserResponse.retrieve(UserRequest.java:253)
        at hudson.remoting.Channel.call(Channel.java:830)
        at hudson.maven.ProcessCache$MavenProcess.call(ProcessCache.java:161)
        at hudson.maven.MavenModuleSetBuild$MavenModuleSetBuildExecution.doRun(MavenModuleSetBuild.java:878)
        at hudson.model.AbstractBuild$AbstractBuildExecution.run(AbstractBuild.java:490)
        at hudson.model.Run.execute(Run.java:1735)
        at hudson.maven.MavenModuleSetBuild.run(MavenModuleSetBuild.java:542)
        at hudson.model.ResourceController.execute(ResourceController.java:97)
        at hudson.model.Executor.run(Executor.java:405)
Caused by: java.lang.reflect.InvocationTargetException
        at sun.reflect.NativeMethodAccessorImpl.invoke0(Native Method)
        at sun.reflect.NativeMethodAccessorImpl.invoke(NativeMethodAccessorImpl.java:62)
        at sun.reflect.DelegatingMethodAccessorImpl.invoke(DelegatingMethodAccessorImpl.java:43)
        at java.lang.reflect.Method.invoke(Method.java:498)
        at hudson.maven.Maven3Builder.call(Maven3Builder.java:139)
        at hudson.maven.Maven3Builder.call(Maven3Builder.java:70)
        at hudson.remoting.UserRequest.perform(UserRequest.java:153)
        at hudson.remoting.UserRequest.perform(UserRequest.java:50)
        at hudson.remoting.Request$2.run(Request.java:336)
        at hudson.remoting.InterceptingExecutorService$1.call(InterceptingExecutorService.java:68)
        at java.util.concurrent.FutureTask.run(FutureTask.java:266)
        at java.util.concurrent.ThreadPoolExecutor.runWorker(ThreadPoolExecutor.java:1142)
        at java.util.concurrent.ThreadPoolExecutor$Worker.run(ThreadPoolExecutor.java:617)
        at java.lang.Thread.run(Thread.java:748)
Caused by: java.lang.Exception: java.lang.reflect.InvocationTargetException
        at org.jvnet.hudson.maven3.agent.Maven3Main.launch(Maven3Main.java:184)
        ... 14 more
Caused by: java.lang.reflect.InvocationTargetException
        at sun.reflect.NativeMethodAccessorImpl.invoke0(Native Method)
        at sun.reflect.NativeMethodAccessorImpl.invoke(NativeMethodAccessorImpl.java:62)
        at sun.reflect.DelegatingMethodAccessorImpl.invoke(DelegatingMethodAccessorImpl.java:43)
        at java.lang.reflect.Method.invoke(Method.java:498)
        at org.codehaus.plexus.classworlds.launcher.Launcher.launchStandard(Launcher.java:329)
        at org.codehaus.plexus.classworlds.launcher.Launcher.launch(Launcher.java:239)
        at org.jvnet.hudson.maven3.agent.Maven3Main.launch(Maven3Main.java:181)
        ... 14 more
Caused by: java.lang.NoSuchMethodError: org.codehaus.plexus.util.xml.pull.MXParser.<init>(Lorg/codehaus/plexus/util/xml/pull/EntityReplacementMap;)V
        at org.apache.maven.plugin.invoker.model.io.xpp3.BuildJobXpp3Reader.read(BuildJobXpp3Reader.java:510)
        at org.apache.maven.plugin.invoker.model.io.xpp3.BuildJobXpp3Reader.read(BuildJobXpp3Reader.java:529)
        at org.apache.maven.plugin.invoker.model.io.xpp3.BuildJobXpp3Reader.read(BuildJobXpp3Reader.java:558)
        at org.jenkinsci.plugins.maveninvoker.MavenInvokerArchiver.postExecute(MavenInvokerArchiver.java:113)
        at hudson.maven.Maven3Builder$MavenExecutionListener.recordMojoEnded(Maven3Builder.java:629)
        at hudson.maven.Maven3Builder$MavenExecutionListener.mojoSucceeded(Maven3Builder.java:610)
        at org.apache.maven.lifecycle.internal.DefaultExecutionEventCatapult.fire(DefaultExecutionEventCatapult.java:87)
        at org.apache.maven.lifecycle.internal.DefaultExecutionEventCatapult.fire(DefaultExecutionEventCatapult.java:42)
        at org.apache.maven.lifecycle.internal.MojoExecutor.execute(MojoExecutor.java:228)
        at org.apache.maven.lifecycle.internal.MojoExecutor.execute(MojoExecutor.java:153)
        at org.apache.maven.lifecycle.internal.MojoExecutor.execute(MojoExecutor.java:145)
        at org.apache.maven.lifecycle.internal.LifecycleModuleBuilder.buildProject(LifecycleModuleBuilder.java:84)
        at org.apache.maven.lifecycle.internal.LifecycleModuleBuilder.buildProject(LifecycleModuleBuilder.java:59)
        at org.apache.maven.lifecycle.internal.LifecycleStarter.singleThreadedBuild(LifecycleStarter.java:183)
        at org.apache.maven.lifecycle.internal.LifecycleStarter.execute(LifecycleStarter.java:161)
        at org.apache.maven.DefaultMaven.doExecute(DefaultMaven.java:320)
        at org.apache.maven.DefaultMaven.execute(DefaultMaven.java:156)
        at org.jvnet.hudson.maven3.launcher.Maven3Launcher.main(Maven3Launcher.java:117)
        ... 21 more
channel stopped
Reply | Threaded
Open this post in threaded view
|  
Report Content as Inappropriate

Build failed in Jenkins: OpenJPA-trunk-deploy #551

Apache Jenkins Server-2
See <https://builds.apache.org/job/OpenJPA-trunk-deploy/551/display/redirect?page=changes>

Changes:

[struberg] OPENJPA-2707 set Java version to 1.8

------------------------------------------
[...truncated 1.69 MB...]
[INFO]                                                                        
[INFO] ------------------------------------------------------------------------
[INFO] Building OpenJPA Maven Plugin 3.0.0-SNAPSHOT
[INFO] ------------------------------------------------------------------------
[INFO]
[INFO] --- maven-clean-plugin:3.0.0:clean (default-clean) @ openjpa-maven-plugin ---
[INFO]
[INFO] --- buildnumber-maven-plugin:1.4:create (default) @ openjpa-maven-plugin ---
[INFO]
[INFO] --- maven-enforcer-plugin:1.4.1:enforce (default) @ openjpa-maven-plugin ---
[INFO]
[INFO] --- maven-plugin-plugin:3.4:helpmojo (help-goal) @ openjpa-maven-plugin ---
[INFO] Using 'UTF-8' encoding to read mojo metadata.
[INFO] Mojo extractor with id: java-javadoc found 0 mojo descriptors.
[INFO] Mojo extractor with id: java-annotations found 0 mojo descriptors.
[INFO]
[INFO] --- maven-checkstyle-plugin:2.9:checkstyle (default) @ openjpa-maven-plugin ---
[INFO] Starting audit...
Audit done.

[WARNING] Unable to locate Source XRef to link to - DISABLED
[INFO]
[INFO] --- maven-plugin-plugin:3.4:descriptor (default-descriptor) @ openjpa-maven-plugin ---
[INFO] Using 'UTF-8' encoding to read mojo metadata.
[INFO] Mojo extractor with id: java-javadoc found 0 mojo descriptors.
[INFO] Mojo extractor with id: java-annotations found 0 mojo descriptors.
[INFO]
[INFO] --- maven-remote-resources-plugin:1.5:process (process-resource-bundles) @ openjpa-maven-plugin ---
[INFO]
[INFO] --- maven-resources-plugin:2.7:resources (default-resources) @ openjpa-maven-plugin ---
[INFO] Using 'UTF-8' encoding to copy filtered resources.
[INFO] skip non existing resourceDirectory <https://builds.apache.org/job/OpenJPA-trunk-deploy/ws/trunk/openjpa-tools/openjpa-maven-plugin/src/main/resources>
[INFO] Copying 3 resources
[INFO]
[INFO] --- maven-compiler-plugin:3.5.1:compile (default-compile) @ openjpa-maven-plugin ---
[INFO] Changes detected - recompiling the module!
[INFO] Compiling 8 source files to <https://builds.apache.org/job/OpenJPA-trunk-deploy/ws/trunk/openjpa-tools/openjpa-maven-plugin/target/classes>
[INFO] <https://builds.apache.org/job/OpenJPA-trunk-deploy/ws/trunk/openjpa-tools/openjpa-maven-plugin/src/main/java/org/apache/openjpa/tools/maven/AbstractOpenJpaMojo.java>: <https://builds.apache.org/job/OpenJPA-trunk-deploy/ws/trunk/openjpa-tools/openjpa-maven-plugin/src/main/java/org/apache/openjpa/tools/maven/AbstractOpenJpaMojo.java> uses unchecked or unsafe operations.
[INFO] <https://builds.apache.org/job/OpenJPA-trunk-deploy/ws/trunk/openjpa-tools/openjpa-maven-plugin/src/main/java/org/apache/openjpa/tools/maven/AbstractOpenJpaMojo.java>: Recompile with -Xlint:unchecked for details.
[INFO]
[INFO] --- maven-plugin-plugin:3.4:descriptor (mojo-descriptor) @ openjpa-maven-plugin ---
[INFO] Using 'UTF-8' encoding to read mojo metadata.
[INFO] Mojo extractor with id: java-javadoc found 0 mojo descriptors.
[INFO] Mojo extractor with id: java-annotations found 5 mojo descriptors.
[INFO]
[INFO] --- maven-compiler-plugin:3.5.1:testCompile (test-source-compile) @ openjpa-maven-plugin ---
[INFO] Changes detected - recompiling the module!
[INFO] Compiling 3 source files to <https://builds.apache.org/job/OpenJPA-trunk-deploy/ws/trunk/openjpa-tools/openjpa-maven-plugin/target/test-classes>
[INFO]
[INFO] --- maven-resources-plugin:2.7:testResources (default-testResources) @ openjpa-maven-plugin ---
[INFO] Using 'UTF-8' encoding to copy filtered resources.
[INFO] Copying 4 resources
[INFO] Copying 3 resources
[INFO]
[INFO] --- maven-compiler-plugin:3.5.1:testCompile (default-testCompile) @ openjpa-maven-plugin ---
[INFO] Changes detected - recompiling the module!
[INFO] Compiling 3 source files to <https://builds.apache.org/job/OpenJPA-trunk-deploy/ws/trunk/openjpa-tools/openjpa-maven-plugin/target/test-classes>
[INFO]
[INFO] --- maven-surefire-plugin:2.19.1:test (default-test) @ openjpa-maven-plugin ---

-------------------------------------------------------
 T E S T S
-------------------------------------------------------
Running org.apache.openjpa.tools.maven.OpenJpaEnhancerMojoTest
Tests run: 1, Failures: 0, Errors: 0, Skipped: 0, Time elapsed: 0.817 sec - in org.apache.openjpa.tools.maven.OpenJpaEnhancerMojoTest

Results :

Tests run: 1, Failures: 0, Errors: 0, Skipped: 0

[JENKINS] Recording test results
[INFO]
[INFO] --- maven-jar-plugin:3.0.2:jar (default-jar) @ openjpa-maven-plugin ---
[INFO] Building jar: <https://builds.apache.org/job/OpenJPA-trunk-deploy/ws/trunk/openjpa-tools/openjpa-maven-plugin/target/openjpa-maven-plugin-3.0.0-SNAPSHOT.jar>
[INFO]
[INFO] --- maven-plugin-plugin:3.4:addPluginArtifactMetadata (default-addPluginArtifactMetadata) @ openjpa-maven-plugin ---
[INFO]
[INFO] --- maven-site-plugin:3.5.1:attach-descriptor (attach-descriptor) @ openjpa-maven-plugin ---
[INFO]
[INFO] --- maven-jar-plugin:3.0.2:test-jar (attach-tests) @ openjpa-maven-plugin ---
[INFO] Building jar: <https://builds.apache.org/job/OpenJPA-trunk-deploy/ws/trunk/openjpa-tools/openjpa-maven-plugin/target/openjpa-maven-plugin-3.0.0-SNAPSHOT-tests.jar>
[INFO]
[INFO] --- maven-invoker-plugin:2.0.0:install (integration-test) @ openjpa-maven-plugin ---
[INFO] Installing <https://builds.apache.org/job/OpenJPA-trunk-deploy/ws/trunk/pom.xml> to <https://builds.apache.org/job/OpenJPA-trunk-deploy/ws/trunk/openjpa-tools/openjpa-maven-plugin/target/local-repo/org/apache/openjpa/openjpa-parent/3.0.0-SNAPSHOT/openjpa-parent-3.0.0-SNAPSHOT.pom>
[INFO] Installing <https://builds.apache.org/job/OpenJPA-trunk-deploy/ws/trunk/target/openjpa-parent-3.0.0-SNAPSHOT-site.xml> to <https://builds.apache.org/job/OpenJPA-trunk-deploy/ws/trunk/openjpa-tools/openjpa-maven-plugin/target/local-repo/org/apache/openjpa/openjpa-parent/3.0.0-SNAPSHOT/openjpa-parent-3.0.0-SNAPSHOT-site.xml>
[INFO] Installing <https://builds.apache.org/job/OpenJPA-trunk-deploy/ws/trunk/openjpa-lib/pom.xml> to <https://builds.apache.org/job/OpenJPA-trunk-deploy/ws/trunk/openjpa-tools/openjpa-maven-plugin/target/local-repo/org/apache/openjpa/openjpa-lib/3.0.0-SNAPSHOT/openjpa-lib-3.0.0-SNAPSHOT.pom>
[INFO] Installing <https://builds.apache.org/job/OpenJPA-trunk-deploy/ws/trunk/openjpa-lib/target/openjpa-lib-3.0.0-SNAPSHOT.jar> to <https://builds.apache.org/job/OpenJPA-trunk-deploy/ws/trunk/openjpa-tools/openjpa-maven-plugin/target/local-repo/org/apache/openjpa/openjpa-lib/3.0.0-SNAPSHOT/openjpa-lib-3.0.0-SNAPSHOT.jar>
[INFO] Installing <https://builds.apache.org/job/OpenJPA-trunk-deploy/ws/trunk/openjpa-lib/pom.xml> to <https://builds.apache.org/job/OpenJPA-trunk-deploy/ws/trunk/openjpa-tools/openjpa-maven-plugin/target/local-repo/org/apache/openjpa/openjpa-lib/3.0.0-SNAPSHOT/openjpa-lib-3.0.0-SNAPSHOT.pom>
[INFO] Installing <https://builds.apache.org/job/OpenJPA-trunk-deploy/ws/trunk/openjpa-lib/target/openjpa-lib-3.0.0-SNAPSHOT-tests.jar> to <https://builds.apache.org/job/OpenJPA-trunk-deploy/ws/trunk/openjpa-tools/openjpa-maven-plugin/target/local-repo/org/apache/openjpa/openjpa-lib/3.0.0-SNAPSHOT/openjpa-lib-3.0.0-SNAPSHOT-tests.jar>
[INFO] Installing <https://builds.apache.org/job/OpenJPA-trunk-deploy/ws/trunk/openjpa-kernel/pom.xml> to <https://builds.apache.org/job/OpenJPA-trunk-deploy/ws/trunk/openjpa-tools/openjpa-maven-plugin/target/local-repo/org/apache/openjpa/openjpa-kernel/3.0.0-SNAPSHOT/openjpa-kernel-3.0.0-SNAPSHOT.pom>
[INFO] Installing <https://builds.apache.org/job/OpenJPA-trunk-deploy/ws/trunk/openjpa-kernel/target/openjpa-kernel-3.0.0-SNAPSHOT.jar> to <https://builds.apache.org/job/OpenJPA-trunk-deploy/ws/trunk/openjpa-tools/openjpa-maven-plugin/target/local-repo/org/apache/openjpa/openjpa-kernel/3.0.0-SNAPSHOT/openjpa-kernel-3.0.0-SNAPSHOT.jar>
[INFO] Installing <https://builds.apache.org/job/OpenJPA-trunk-deploy/ws/trunk/openjpa-kernel/pom.xml> to <https://builds.apache.org/job/OpenJPA-trunk-deploy/ws/trunk/openjpa-tools/openjpa-maven-plugin/target/local-repo/org/apache/openjpa/openjpa-kernel/3.0.0-SNAPSHOT/openjpa-kernel-3.0.0-SNAPSHOT.pom>
[INFO] Installing <https://builds.apache.org/job/OpenJPA-trunk-deploy/ws/trunk/openjpa-kernel/target/openjpa-kernel-3.0.0-SNAPSHOT-tests.jar> to <https://builds.apache.org/job/OpenJPA-trunk-deploy/ws/trunk/openjpa-tools/openjpa-maven-plugin/target/local-repo/org/apache/openjpa/openjpa-kernel/3.0.0-SNAPSHOT/openjpa-kernel-3.0.0-SNAPSHOT-tests.jar>
[INFO] Installing <https://builds.apache.org/job/OpenJPA-trunk-deploy/ws/trunk/openjpa-jdbc/pom.xml> to <https://builds.apache.org/job/OpenJPA-trunk-deploy/ws/trunk/openjpa-tools/openjpa-maven-plugin/target/local-repo/org/apache/openjpa/openjpa-jdbc/3.0.0-SNAPSHOT/openjpa-jdbc-3.0.0-SNAPSHOT.pom>
[INFO] Installing <https://builds.apache.org/job/OpenJPA-trunk-deploy/ws/trunk/openjpa-jdbc/target/openjpa-jdbc-3.0.0-SNAPSHOT.jar> to <https://builds.apache.org/job/OpenJPA-trunk-deploy/ws/trunk/openjpa-tools/openjpa-maven-plugin/target/local-repo/org/apache/openjpa/openjpa-jdbc/3.0.0-SNAPSHOT/openjpa-jdbc-3.0.0-SNAPSHOT.jar>
[INFO] Installing <https://builds.apache.org/job/OpenJPA-trunk-deploy/ws/trunk/openjpa-jdbc/pom.xml> to <https://builds.apache.org/job/OpenJPA-trunk-deploy/ws/trunk/openjpa-tools/openjpa-maven-plugin/target/local-repo/org/apache/openjpa/openjpa-jdbc/3.0.0-SNAPSHOT/openjpa-jdbc-3.0.0-SNAPSHOT.pom>
[INFO] Installing <https://builds.apache.org/job/OpenJPA-trunk-deploy/ws/trunk/openjpa-jdbc/target/openjpa-jdbc-3.0.0-SNAPSHOT-tests.jar> to <https://builds.apache.org/job/OpenJPA-trunk-deploy/ws/trunk/openjpa-tools/openjpa-maven-plugin/target/local-repo/org/apache/openjpa/openjpa-jdbc/3.0.0-SNAPSHOT/openjpa-jdbc-3.0.0-SNAPSHOT-tests.jar>
[INFO] Installing <https://builds.apache.org/job/OpenJPA-trunk-deploy/ws/trunk/openjpa-persistence/pom.xml> to <https://builds.apache.org/job/OpenJPA-trunk-deploy/ws/trunk/openjpa-tools/openjpa-maven-plugin/target/local-repo/org/apache/openjpa/openjpa-persistence/3.0.0-SNAPSHOT/openjpa-persistence-3.0.0-SNAPSHOT.pom>
[INFO] Installing <https://builds.apache.org/job/OpenJPA-trunk-deploy/ws/trunk/openjpa-persistence/target/openjpa-persistence-3.0.0-SNAPSHOT.jar> to <https://builds.apache.org/job/OpenJPA-trunk-deploy/ws/trunk/openjpa-tools/openjpa-maven-plugin/target/local-repo/org/apache/openjpa/openjpa-persistence/3.0.0-SNAPSHOT/openjpa-persistence-3.0.0-SNAPSHOT.jar>
[INFO] Installing <https://builds.apache.org/job/OpenJPA-trunk-deploy/ws/trunk/openjpa-persistence/pom.xml> to <https://builds.apache.org/job/OpenJPA-trunk-deploy/ws/trunk/openjpa-tools/openjpa-maven-plugin/target/local-repo/org/apache/openjpa/openjpa-persistence/3.0.0-SNAPSHOT/openjpa-persistence-3.0.0-SNAPSHOT.pom>
[INFO] Installing <https://builds.apache.org/job/OpenJPA-trunk-deploy/ws/trunk/openjpa-persistence/target/openjpa-persistence-3.0.0-SNAPSHOT-tests.jar> to <https://builds.apache.org/job/OpenJPA-trunk-deploy/ws/trunk/openjpa-tools/openjpa-maven-plugin/target/local-repo/org/apache/openjpa/openjpa-persistence/3.0.0-SNAPSHOT/openjpa-persistence-3.0.0-SNAPSHOT-tests.jar>
[INFO] Installing <https://builds.apache.org/job/OpenJPA-trunk-deploy/ws/trunk/openjpa-persistence-jdbc/pom.xml> to <https://builds.apache.org/job/OpenJPA-trunk-deploy/ws/trunk/openjpa-tools/openjpa-maven-plugin/target/local-repo/org/apache/openjpa/openjpa-persistence-jdbc/3.0.0-SNAPSHOT/openjpa-persistence-jdbc-3.0.0-SNAPSHOT.pom>
[INFO] Installing <https://builds.apache.org/job/OpenJPA-trunk-deploy/ws/trunk/openjpa-persistence-jdbc/target/openjpa-persistence-jdbc-3.0.0-SNAPSHOT.jar> to <https://builds.apache.org/job/OpenJPA-trunk-deploy/ws/trunk/openjpa-tools/openjpa-maven-plugin/target/local-repo/org/apache/openjpa/openjpa-persistence-jdbc/3.0.0-SNAPSHOT/openjpa-persistence-jdbc-3.0.0-SNAPSHOT.jar>
[INFO] Installing <https://builds.apache.org/job/OpenJPA-trunk-deploy/ws/trunk/openjpa-persistence-jdbc/pom.xml> to <https://builds.apache.org/job/OpenJPA-trunk-deploy/ws/trunk/openjpa-tools/openjpa-maven-plugin/target/local-repo/org/apache/openjpa/openjpa-persistence-jdbc/3.0.0-SNAPSHOT/openjpa-persistence-jdbc-3.0.0-SNAPSHOT.pom>
[INFO] Installing <https://builds.apache.org/job/OpenJPA-trunk-deploy/ws/trunk/openjpa-persistence-jdbc/target/openjpa-persistence-jdbc-3.0.0-SNAPSHOT-tests.jar> to <https://builds.apache.org/job/OpenJPA-trunk-deploy/ws/trunk/openjpa-tools/openjpa-maven-plugin/target/local-repo/org/apache/openjpa/openjpa-persistence-jdbc/3.0.0-SNAPSHOT/openjpa-persistence-jdbc-3.0.0-SNAPSHOT-tests.jar>
[INFO] Installing <https://builds.apache.org/job/OpenJPA-trunk-deploy/ws/trunk/openjpa-persistence-locking/pom.xml> to <https://builds.apache.org/job/OpenJPA-trunk-deploy/ws/trunk/openjpa-tools/openjpa-maven-plugin/target/local-repo/org/apache/openjpa/openjpa-persistence-locking/3.0.0-SNAPSHOT/openjpa-persistence-locking-3.0.0-SNAPSHOT.pom>
[INFO] Installing <https://builds.apache.org/job/OpenJPA-trunk-deploy/ws/trunk/openjpa-persistence-locking/target/openjpa-persistence-locking-3.0.0-SNAPSHOT.jar> to <https://builds.apache.org/job/OpenJPA-trunk-deploy/ws/trunk/openjpa-tools/openjpa-maven-plugin/target/local-repo/org/apache/openjpa/openjpa-persistence-locking/3.0.0-SNAPSHOT/openjpa-persistence-locking-3.0.0-SNAPSHOT.jar>
[INFO] Installing <https://builds.apache.org/job/OpenJPA-trunk-deploy/ws/trunk/openjpa-persistence-locking/pom.xml> to <https://builds.apache.org/job/OpenJPA-trunk-deploy/ws/trunk/openjpa-tools/openjpa-maven-plugin/target/local-repo/org/apache/openjpa/openjpa-persistence-locking/3.0.0-SNAPSHOT/openjpa-persistence-locking-3.0.0-SNAPSHOT.pom>
[INFO] Installing <https://builds.apache.org/job/OpenJPA-trunk-deploy/ws/trunk/openjpa-persistence-locking/target/openjpa-persistence-locking-3.0.0-SNAPSHOT-tests.jar> to <https://builds.apache.org/job/OpenJPA-trunk-deploy/ws/trunk/openjpa-tools/openjpa-maven-plugin/target/local-repo/org/apache/openjpa/openjpa-persistence-locking/3.0.0-SNAPSHOT/openjpa-persistence-locking-3.0.0-SNAPSHOT-tests.jar>
[INFO] Installing <https://builds.apache.org/job/OpenJPA-trunk-deploy/ws/trunk/openjpa-tools/pom.xml> to <https://builds.apache.org/job/OpenJPA-trunk-deploy/ws/trunk/openjpa-tools/openjpa-maven-plugin/target/local-repo/org/apache/openjpa/openjpa-tools/3.0.0-SNAPSHOT/openjpa-tools-3.0.0-SNAPSHOT.pom>
[INFO] Installing <https://builds.apache.org/job/OpenJPA-trunk-deploy/ws/trunk/openjpa-tools/openjpa-maven-plugin/pom.xml> to <https://builds.apache.org/job/OpenJPA-trunk-deploy/ws/trunk/openjpa-tools/openjpa-maven-plugin/target/local-repo/org/apache/openjpa/openjpa-maven-plugin/3.0.0-SNAPSHOT/openjpa-maven-plugin-3.0.0-SNAPSHOT.pom>
[INFO] Installing <https://builds.apache.org/job/OpenJPA-trunk-deploy/ws/trunk/openjpa-tools/openjpa-maven-plugin/target/openjpa-maven-plugin-3.0.0-SNAPSHOT.jar> to <https://builds.apache.org/job/OpenJPA-trunk-deploy/ws/trunk/openjpa-tools/openjpa-maven-plugin/target/local-repo/org/apache/openjpa/openjpa-maven-plugin/3.0.0-SNAPSHOT/openjpa-maven-plugin-3.0.0-SNAPSHOT.jar>
[INFO] Installing <https://builds.apache.org/job/OpenJPA-trunk-deploy/ws/trunk/openjpa-tools/openjpa-maven-plugin/target/openjpa-maven-plugin-3.0.0-SNAPSHOT-tests.jar> to <https://builds.apache.org/job/OpenJPA-trunk-deploy/ws/trunk/openjpa-tools/openjpa-maven-plugin/target/local-repo/org/apache/openjpa/openjpa-maven-plugin/3.0.0-SNAPSHOT/openjpa-maven-plugin-3.0.0-SNAPSHOT-tests.jar>
[INFO]
[INFO] --- maven-invoker-plugin:2.0.0:run (integration-test) @ openjpa-maven-plugin ---
[INFO] Building: sqlActionDropSchema/pom.xml
[INFO] ..SUCCESS (13.1 s)
[INFO] Building: testDependencies/pom.xml
[INFO] ..SUCCESS (8.0 s)
[INFO] Building: default_settings/pom.xml
[INFO] ..SUCCESS (8.2 s)
[INFO] Building: nonDefaultPersistenceXml/pom.xml
[INFO] ..SUCCESS (6.8 s)
[INFO] Building: enhanceIncludesExcludes/pom.xml
[INFO] run script verify.groovy
[INFO] ..SUCCESS (6.8 s)
[INFO] Building: dependingArtifact/pom.xml
[INFO] ..SUCCESS (6.9 s)
[INFO] -------------------------------------------------
[INFO] Build Summary:
[INFO]   Passed: 6, Failed: 0, Errors: 0, Skipped: 0
[INFO] -------------------------------------------------
MavenInvokerArchiver
found reports:[<https://builds.apache.org/job/OpenJPA-trunk-deploy/ws/trunk/openjpa-tools/openjpa-maven-plugin/target/invoker-reports/BUILD-enhanceIncludesExcludes.xml,> <https://builds.apache.org/job/OpenJPA-trunk-deploy/ws/trunk/openjpa-tools/openjpa-maven-plugin/target/invoker-reports/BUILD-nonDefaultPersistenceXml.xml,> <https://builds.apache.org/job/OpenJPA-trunk-deploy/ws/trunk/openjpa-tools/openjpa-maven-plugin/target/invoker-reports/BUILD-testDependencies.xml,> <https://builds.apache.org/job/OpenJPA-trunk-deploy/ws/trunk/openjpa-tools/openjpa-maven-plugin/target/invoker-reports/BUILD-default_settings.xml,> <https://builds.apache.org/job/OpenJPA-trunk-deploy/ws/trunk/openjpa-tools/openjpa-maven-plugin/target/invoker-reports/BUILD-sqlActionDropSchema.xml,> <https://builds.apache.org/job/OpenJPA-trunk-deploy/ws/trunk/openjpa-tools/openjpa-maven-plugin/target/invoker-reports/BUILD-dependingArtifact.xml]>
java.lang.reflect.InvocationTargetException
        at sun.reflect.NativeMethodAccessorImpl.invoke0(Native Method)
        at sun.reflect.NativeMethodAccessorImpl.invoke(NativeMethodAccessorImpl.java:62)
        at sun.reflect.DelegatingMethodAccessorImpl.invoke(DelegatingMethodAccessorImpl.java:43)
        at java.lang.reflect.Method.invoke(Method.java:498)
        at org.codehaus.plexus.classworlds.launcher.Launcher.launchStandard(Launcher.java:329)
        at org.codehaus.plexus.classworlds.launcher.Launcher.launch(Launcher.java:239)
        at org.jvnet.hudson.maven3.agent.Maven3Main.launch(Maven3Main.java:181)
        at sun.reflect.NativeMethodAccessorImpl.invoke0(Native Method)
        at sun.reflect.NativeMethodAccessorImpl.invoke(NativeMethodAccessorImpl.java:62)
        at sun.reflect.DelegatingMethodAccessorImpl.invoke(DelegatingMethodAccessorImpl.java:43)
        at java.lang.reflect.Method.invoke(Method.java:498)
        at hudson.maven.Maven3Builder.call(Maven3Builder.java:139)
        at hudson.maven.Maven3Builder.call(Maven3Builder.java:70)
        at hudson.remoting.UserRequest.perform(UserRequest.java:153)
        at hudson.remoting.UserRequest.perform(UserRequest.java:50)
        at hudson.remoting.Request$2.run(Request.java:336)
        at hudson.remoting.InterceptingExecutorService$1.call(InterceptingExecutorService.java:68)
        at java.util.concurrent.FutureTask.run(FutureTask.java:266)
        at java.util.concurrent.ThreadPoolExecutor.runWorker(ThreadPoolExecutor.java:1142)
        at java.util.concurrent.ThreadPoolExecutor$Worker.run(ThreadPoolExecutor.java:617)
        at java.lang.Thread.run(Thread.java:748)
Caused by: java.lang.NoSuchMethodError: org.codehaus.plexus.util.xml.pull.MXParser.<init>(Lorg/codehaus/plexus/util/xml/pull/EntityReplacementMap;)V
        at org.apache.maven.plugin.invoker.model.io.xpp3.BuildJobXpp3Reader.read(BuildJobXpp3Reader.java:510)
        at org.apache.maven.plugin.invoker.model.io.xpp3.BuildJobXpp3Reader.read(BuildJobXpp3Reader.java:529)
        at org.apache.maven.plugin.invoker.model.io.xpp3.BuildJobXpp3Reader.read(BuildJobXpp3Reader.java:558)
        at org.jenkinsci.plugins.maveninvoker.MavenInvokerArchiver.postExecute(MavenInvokerArchiver.java:113)
        at hudson.maven.Maven3Builder$MavenExecutionListener.recordMojoEnded(Maven3Builder.java:629)
        at hudson.maven.Maven3Builder$MavenExecutionListener.mojoSucceeded(Maven3Builder.java:610)
        at org.apache.maven.lifecycle.internal.DefaultExecutionEventCatapult.fire(DefaultExecutionEventCatapult.java:87)
        at org.apache.maven.lifecycle.internal.DefaultExecutionEventCatapult.fire(DefaultExecutionEventCatapult.java:42)
        at org.apache.maven.lifecycle.internal.MojoExecutor.execute(MojoExecutor.java:228)
        at org.apache.maven.lifecycle.internal.MojoExecutor.execute(MojoExecutor.java:153)
        at org.apache.maven.lifecycle.internal.MojoExecutor.execute(MojoExecutor.java:145)
        at org.apache.maven.lifecycle.internal.LifecycleModuleBuilder.buildProject(LifecycleModuleBuilder.java:84)
        at org.apache.maven.lifecycle.internal.LifecycleModuleBuilder.buildProject(LifecycleModuleBuilder.java:59)
        at org.apache.maven.lifecycle.internal.LifecycleStarter.singleThreadedBuild(LifecycleStarter.java:183)
        at org.apache.maven.lifecycle.internal.LifecycleStarter.execute(LifecycleStarter.java:161)
        at org.apache.maven.DefaultMaven.doExecute(DefaultMaven.java:320)
        at org.apache.maven.DefaultMaven.execute(DefaultMaven.java:156)
        at org.jvnet.hudson.maven3.launcher.Maven3Launcher.main(Maven3Launcher.java:117)
        ... 21 more
Sending e-mails to: [hidden email]
Sending e-mails to: [hidden email]
ERROR: Failed to parse POMs
java.io.IOException: java.lang.reflect.InvocationTargetException
        at hudson.maven.Maven3Builder.call(Maven3Builder.java:179)
        at hudson.maven.Maven3Builder.call(Maven3Builder.java:70)
        at hudson.remoting.UserRequest.perform(UserRequest.java:153)
        at hudson.remoting.UserRequest.perform(UserRequest.java:50)
        at hudson.remoting.Request$2.run(Request.java:336)
        at hudson.remoting.InterceptingExecutorService$1.call(InterceptingExecutorService.java:68)
        at java.util.concurrent.FutureTask.run(FutureTask.java:266)
        at java.util.concurrent.ThreadPoolExecutor.runWorker(ThreadPoolExecutor.java:1142)
        at java.util.concurrent.ThreadPoolExecutor$Worker.run(ThreadPoolExecutor.java:617)
        at java.lang.Thread.run(Thread.java:748)
        at ......remote call to Channel to Maven [/home/jenkins/tools/java/latest1.8/bin/java, -Xmx1280m, -XX:MaxPermSize=512m, -cp, /home/jenkins/jenkins-slave/maven3-agent.jar:/home/jenkins/tools/maven/apache-maven-3.0.4/boot/plexus-classworlds-2.4.jar, org.jvnet.hudson.maven3.agent.Maven3Main, /home/jenkins/tools/maven/apache-maven-3.0.4, /home/jenkins/jenkins-slave/slave.jar, /home/jenkins/jenkins-slave/maven3-interceptor.jar, /home/jenkins/jenkins-slave/maven3-interceptor-commons.jar, 46694](Native Method)
        at hudson.remoting.Channel.attachCallSiteStackTrace(Channel.java:1545)
        at hudson.remoting.UserResponse.retrieve(UserRequest.java:253)
        at hudson.remoting.Channel.call(Channel.java:830)
        at hudson.maven.ProcessCache$MavenProcess.call(ProcessCache.java:161)
        at hudson.maven.MavenModuleSetBuild$MavenModuleSetBuildExecution.doRun(MavenModuleSetBuild.java:878)
        at hudson.model.AbstractBuild$AbstractBuildExecution.run(AbstractBuild.java:490)
        at hudson.model.Run.execute(Run.java:1735)
        at hudson.maven.MavenModuleSetBuild.run(MavenModuleSetBuild.java:542)
        at hudson.model.ResourceController.execute(ResourceController.java:97)
        at hudson.model.Executor.run(Executor.java:405)
Caused by: java.lang.reflect.InvocationTargetException
        at sun.reflect.NativeMethodAccessorImpl.invoke0(Native Method)
        at sun.reflect.NativeMethodAccessorImpl.invoke(NativeMethodAccessorImpl.java:62)
        at sun.reflect.DelegatingMethodAccessorImpl.invoke(DelegatingMethodAccessorImpl.java:43)
        at java.lang.reflect.Method.invoke(Method.java:498)
        at hudson.maven.Maven3Builder.call(Maven3Builder.java:139)
        at hudson.maven.Maven3Builder.call(Maven3Builder.java:70)
        at hudson.remoting.UserRequest.perform(UserRequest.java:153)
        at hudson.remoting.UserRequest.perform(UserRequest.java:50)
        at hudson.remoting.Request$2.run(Request.java:336)
        at hudson.remoting.InterceptingExecutorService$1.call(InterceptingExecutorService.java:68)
        at java.util.concurrent.FutureTask.run(FutureTask.java:266)
        at java.util.concurrent.ThreadPoolExecutor.runWorker(ThreadPoolExecutor.java:1142)
        at java.util.concurrent.ThreadPoolExecutor$Worker.run(ThreadPoolExecutor.java:617)
        at java.lang.Thread.run(Thread.java:748)
Caused by: java.lang.Exception: java.lang.reflect.InvocationTargetException
        at org.jvnet.hudson.maven3.agent.Maven3Main.launch(Maven3Main.java:184)
        ... 14 more
Caused by: java.lang.reflect.InvocationTargetException
        at sun.reflect.NativeMethodAccessorImpl.invoke0(Native Method)
        at sun.reflect.NativeMethodAccessorImpl.invoke(NativeMethodAccessorImpl.java:62)
        at sun.reflect.DelegatingMethodAccessorImpl.invoke(DelegatingMethodAccessorImpl.java:43)
        at java.lang.reflect.Method.invoke(Method.java:498)
        at org.codehaus.plexus.classworlds.launcher.Launcher.launchStandard(Launcher.java:329)
        at org.codehaus.plexus.classworlds.launcher.Launcher.launch(Launcher.java:239)
        at org.jvnet.hudson.maven3.agent.Maven3Main.launch(Maven3Main.java:181)
        ... 14 more
Caused by: java.lang.NoSuchMethodError: org.codehaus.plexus.util.xml.pull.MXParser.<init>(Lorg/codehaus/plexus/util/xml/pull/EntityReplacementMap;)V
        at org.apache.maven.plugin.invoker.model.io.xpp3.BuildJobXpp3Reader.read(BuildJobXpp3Reader.java:510)
        at org.apache.maven.plugin.invoker.model.io.xpp3.BuildJobXpp3Reader.read(BuildJobXpp3Reader.java:529)
        at org.apache.maven.plugin.invoker.model.io.xpp3.BuildJobXpp3Reader.read(BuildJobXpp3Reader.java:558)
        at org.jenkinsci.plugins.maveninvoker.MavenInvokerArchiver.postExecute(MavenInvokerArchiver.java:113)
        at hudson.maven.Maven3Builder$MavenExecutionListener.recordMojoEnded(Maven3Builder.java:629)
        at hudson.maven.Maven3Builder$MavenExecutionListener.mojoSucceeded(Maven3Builder.java:610)
        at org.apache.maven.lifecycle.internal.DefaultExecutionEventCatapult.fire(DefaultExecutionEventCatapult.java:87)
        at org.apache.maven.lifecycle.internal.DefaultExecutionEventCatapult.fire(DefaultExecutionEventCatapult.java:42)
        at org.apache.maven.lifecycle.internal.MojoExecutor.execute(MojoExecutor.java:228)
        at org.apache.maven.lifecycle.internal.MojoExecutor.execute(MojoExecutor.java:153)
        at org.apache.maven.lifecycle.internal.MojoExecutor.execute(MojoExecutor.java:145)
        at org.apache.maven.lifecycle.internal.LifecycleModuleBuilder.buildProject(LifecycleModuleBuilder.java:84)
        at org.apache.maven.lifecycle.internal.LifecycleModuleBuilder.buildProject(LifecycleModuleBuilder.java:59)
        at org.apache.maven.lifecycle.internal.LifecycleStarter.singleThreadedBuild(LifecycleStarter.java:183)
        at org.apache.maven.lifecycle.internal.LifecycleStarter.execute(LifecycleStarter.java:161)
        at org.apache.maven.DefaultMaven.doExecute(DefaultMaven.java:320)
        at org.apache.maven.DefaultMaven.execute(DefaultMaven.java:156)
        at org.jvnet.hudson.maven3.launcher.Maven3Launcher.main(Maven3Launcher.java:117)
        ... 21 more
channel stopped
Loading...