Jenkins build became unstable: OpenJPA-trunk #1092

classic Classic list List threaded Threaded
8 messages Options
Reply | Threaded
Open this post in threaded view
|  
Report Content as Inappropriate

Jenkins build became unstable: OpenJPA-trunk #1092

Apache Jenkins Server-2
Reply | Threaded
Open this post in threaded view
|  
Report Content as Inappropriate

Jenkins build is still unstable: OpenJPA-trunk #1093

Apache Jenkins Server-2
Reply | Threaded
Open this post in threaded view
|  
Report Content as Inappropriate

Build failed in Jenkins: OpenJPA-trunk #1094

Apache Jenkins Server-2
See <https://builds.apache.org/job/OpenJPA-trunk/1094/display/redirect?page=changes>

Changes:

[struberg] OPENJPA-2689 prevent IllegalArgumentException with package scoped OraclePreparedStatementWrapper classes

------------------------------------------
[...truncated 2.26 MB...]
Downloading: http://repo.maven.apache.org/maven2/org/apache/karaf/deployer/org.apache.karaf.deployer.kar/4.1.0/org.apache.karaf.deployer.kar-4.1.0.pom
Downloaded: http://repo.maven.apache.org/maven2/org/apache/karaf/deployer/org.apache.karaf.deployer.kar/4.1.0/org.apache.karaf.deployer.kar-4.1.0.pom (5 KB at 295.2 KB/sec)
Downloading: http://repo.maven.apache.org/maven2/org/apache/karaf/kar/org.apache.karaf.kar.core/4.1.0/org.apache.karaf.kar.core-4.1.0.pom
Downloaded: http://repo.maven.apache.org/maven2/org/apache/karaf/kar/org.apache.karaf.kar.core/4.1.0/org.apache.karaf.kar.core-4.1.0.pom (5 KB at 53.8 KB/sec)
Downloading: http://repo.maven.apache.org/maven2/org/apache/karaf/shell/org.apache.karaf.shell.console/4.1.0/org.apache.karaf.shell.console-4.1.0.pom
Downloaded: http://repo.maven.apache.org/maven2/org/apache/karaf/shell/org.apache.karaf.shell.console/4.1.0/org.apache.karaf.shell.console-4.1.0.pom (10 KB at 102.8 KB/sec)
Downloading: http://repo.maven.apache.org/maven2/org/apache/karaf/shell/shell/4.1.0/shell-4.1.0.pom
Downloaded: http://repo.maven.apache.org/maven2/org/apache/karaf/shell/shell/4.1.0/shell-4.1.0.pom (2 KB at 18.8 KB/sec)
Downloading: http://repo.maven.apache.org/maven2/org/apache/karaf/jaas/org.apache.karaf.jaas.modules/4.1.0/org.apache.karaf.jaas.modules-4.1.0.pom
Downloaded: http://repo.maven.apache.org/maven2/org/apache/karaf/jaas/org.apache.karaf.jaas.modules/4.1.0/org.apache.karaf.jaas.modules-4.1.0.pom (7 KB at 386.7 KB/sec)
Downloading: http://repo.maven.apache.org/maven2/org/apache/karaf/jaas/org.apache.karaf.jaas.config/4.1.0/org.apache.karaf.jaas.config-4.1.0.pom
Downloaded: http://repo.maven.apache.org/maven2/org/apache/karaf/jaas/org.apache.karaf.jaas.config/4.1.0/org.apache.karaf.jaas.config-4.1.0.pom (5 KB at 53.5 KB/sec)
Downloading: http://repo.maven.apache.org/maven2/org/apache/karaf/shell/org.apache.karaf.shell.core/4.1.0/org.apache.karaf.shell.core-4.1.0.pom
Downloaded: http://repo.maven.apache.org/maven2/org/apache/karaf/shell/org.apache.karaf.shell.core/4.1.0/org.apache.karaf.shell.core-4.1.0.pom (8 KB at 82.3 KB/sec)
Downloading: http://repo.maven.apache.org/maven2/org/apache/sshd/sshd-core/1.2.0/sshd-core-1.2.0.pom
Downloaded: http://repo.maven.apache.org/maven2/org/apache/sshd/sshd-core/1.2.0/sshd-core-1.2.0.pom (9 KB at 514.5 KB/sec)
Downloading: http://repo.maven.apache.org/maven2/org/apache/sshd/sshd/1.2.0/sshd-1.2.0.pom
Downloaded: http://repo.maven.apache.org/maven2/org/apache/sshd/sshd/1.2.0/sshd-1.2.0.pom (50 KB at 2620.9 KB/sec)
Downloading: http://repo.maven.apache.org/maven2/org/apache/karaf/tooling/org.apache.karaf.tools.utils/4.1.0/org.apache.karaf.tools.utils-4.1.0.jar
Downloading: http://repo.maven.apache.org/maven2/org/apache/karaf/profile/org.apache.karaf.profile.core/4.1.0/org.apache.karaf.profile.core-4.1.0.jar
Downloading: http://repo.maven.apache.org/maven2/org/apache/karaf/deployer/org.apache.karaf.deployer.spring/4.1.0/org.apache.karaf.deployer.spring-4.1.0.jar
Downloading: http://repo.maven.apache.org/maven2/org/apache/karaf/deployer/org.apache.karaf.deployer.blueprint/4.1.0/org.apache.karaf.deployer.blueprint-4.1.0.jar
Downloading: http://repo.maven.apache.org/maven2/org/apache/karaf/deployer/org.apache.karaf.deployer.features/4.1.0/org.apache.karaf.deployer.features-4.1.0.jar
Downloaded: http://repo.maven.apache.org/maven2/org/apache/karaf/tooling/org.apache.karaf.tools.utils/4.1.0/org.apache.karaf.tools.utils-4.1.0.jar (27 KB at 1380.4 KB/sec)
Downloading: http://repo.maven.apache.org/maven2/org/apache/karaf/deployer/org.apache.karaf.deployer.kar/4.1.0/org.apache.karaf.deployer.kar-4.1.0.jar
Downloaded: http://repo.maven.apache.org/maven2/org/apache/karaf/profile/org.apache.karaf.profile.core/4.1.0/org.apache.karaf.profile.core-4.1.0.jar (177 KB at 6800.3 KB/sec)
Downloading: http://repo.maven.apache.org/maven2/org/apache/karaf/kar/org.apache.karaf.kar.core/4.1.0/org.apache.karaf.kar.core-4.1.0.jar
Downloaded: http://repo.maven.apache.org/maven2/org/apache/karaf/deployer/org.apache.karaf.deployer.spring/4.1.0/org.apache.karaf.deployer.spring-4.1.0.jar (40 KB at 1636.4 KB/sec)
Downloading: http://repo.maven.apache.org/maven2/org/apache/karaf/shell/org.apache.karaf.shell.console/4.1.0/org.apache.karaf.shell.console-4.1.0.jar
Downloaded: http://repo.maven.apache.org/maven2/org/apache/karaf/deployer/org.apache.karaf.deployer.kar/4.1.0/org.apache.karaf.deployer.kar-4.1.0.jar (22 KB at 1457.4 KB/sec)
Downloading: http://repo.maven.apache.org/maven2/org/apache/karaf/jaas/org.apache.karaf.jaas.modules/4.1.0/org.apache.karaf.jaas.modules-4.1.0.jar
Downloaded: http://repo.maven.apache.org/maven2/org/apache/karaf/kar/org.apache.karaf.kar.core/4.1.0/org.apache.karaf.kar.core-4.1.0.jar (75 KB at 4140.2 KB/sec)
Downloading: http://repo.maven.apache.org/maven2/org/apache/karaf/jaas/org.apache.karaf.jaas.config/4.1.0/org.apache.karaf.jaas.config-4.1.0.jar
Downloaded: http://repo.maven.apache.org/maven2/org/apache/karaf/jaas/org.apache.karaf.jaas.config/4.1.0/org.apache.karaf.jaas.config-4.1.0.jar (42 KB at 2934.2 KB/sec)
Downloading: http://repo.maven.apache.org/maven2/org/apache/karaf/shell/org.apache.karaf.shell.core/4.1.0/org.apache.karaf.shell.core-4.1.0.jar
Downloaded: http://repo.maven.apache.org/maven2/org/apache/karaf/shell/org.apache.karaf.shell.console/4.1.0/org.apache.karaf.shell.console-4.1.0.jar (212 KB at 5557.9 KB/sec)
Downloading: http://repo.maven.apache.org/maven2/org/apache/sshd/sshd-core/1.2.0/sshd-core-1.2.0.jar
Downloaded: http://repo.maven.apache.org/maven2/org/apache/karaf/shell/org.apache.karaf.shell.core/4.1.0/org.apache.karaf.shell.core-4.1.0.jar (587 KB at 13958.7 KB/sec)
Downloaded: http://repo.maven.apache.org/maven2/org/apache/karaf/jaas/org.apache.karaf.jaas.modules/4.1.0/org.apache.karaf.jaas.modules-4.1.0.jar (1211 KB at 16364.2 KB/sec)
Downloaded: http://repo.maven.apache.org/maven2/org/apache/karaf/deployer/org.apache.karaf.deployer.blueprint/4.1.0/org.apache.karaf.deployer.blueprint-4.1.0.jar (40 KB at 312.7 KB/sec)
Downloaded: http://repo.maven.apache.org/maven2/org/apache/karaf/deployer/org.apache.karaf.deployer.features/4.1.0/org.apache.karaf.deployer.features-4.1.0.jar (41 KB at 325.9 KB/sec)
Downloaded: http://repo.maven.apache.org/maven2/org/apache/sshd/sshd-core/1.2.0/sshd-core-1.2.0.jar (1547 KB at 15162.3 KB/sec)
[WARNING] Error injecting: org.apache.karaf.tooling.features.GenerateDescriptorMojo
java.lang.TypeNotPresentException: Type org.apache.karaf.tooling.features.GenerateDescriptorMojo not present
        at org.sonatype.guice.bean.reflect.URLClassSpace.loadClass(URLClassSpace.java:109)
        at org.sonatype.guice.bean.reflect.NamedClass.load(NamedClass.java:45)
        at org.sonatype.guice.bean.reflect.AbstractDeferredClass.get(AbstractDeferredClass.java:45)
        at com.google.inject.internal.ProviderInternalFactory.provision(ProviderInternalFactory.java:84)
        at com.google.inject.internal.InternalFactoryToInitializableAdapter.provision(InternalFactoryToInitializableAdapter.java:52)
        at com.google.inject.internal.ProviderInternalFactory$1.call(ProviderInternalFactory.java:70)
        at com.google.inject.internal.ProvisionListenerStackCallback$Provision.provision(ProvisionListenerStackCallback.java:100)
        at org.sonatype.guice.plexus.lifecycles.PlexusLifecycleManager.onProvision(PlexusLifecycleManager.java:138)
        at com.google.inject.internal.ProvisionListenerStackCallback$Provision.provision(ProvisionListenerStackCallback.java:108)
        at com.google.inject.internal.ProvisionListenerStackCallback.provision(ProvisionListenerStackCallback.java:55)
        at com.google.inject.internal.ProviderInternalFactory.circularGet(ProviderInternalFactory.java:68)
        at com.google.inject.internal.InternalFactoryToInitializableAdapter.get(InternalFactoryToInitializableAdapter.java:45)
        at com.google.inject.internal.InjectorImpl$3$1.call(InjectorImpl.java:965)
        at com.google.inject.internal.InjectorImpl.callInContext(InjectorImpl.java:1011)
        at com.google.inject.internal.InjectorImpl$3.get(InjectorImpl.java:961)
        at com.google.inject.Scopes$1$1.get(Scopes.java:59)
        at org.sonatype.guice.bean.locators.LazyBeanEntry.getValue(LazyBeanEntry.java:83)
        at org.sonatype.guice.plexus.locators.LazyPlexusBean.getValue(LazyPlexusBean.java:49)
        at org.codehaus.plexus.DefaultPlexusContainer.lookup(DefaultPlexusContainer.java:253)
        at org.codehaus.plexus.DefaultPlexusContainer.lookup(DefaultPlexusContainer.java:245)
        at org.apache.maven.plugin.internal.DefaultMavenPluginManager.getConfiguredMojo(DefaultMavenPluginManager.java:455)
        at org.apache.maven.plugin.DefaultBuildPluginManager.executeMojo(DefaultBuildPluginManager.java:92)
        at org.apache.maven.lifecycle.internal.MojoExecutor.execute(MojoExecutor.java:209)
        at org.apache.maven.lifecycle.internal.MojoExecutor.execute(MojoExecutor.java:153)
        at org.apache.maven.lifecycle.internal.MojoExecutor.execute(MojoExecutor.java:145)
        at org.apache.maven.lifecycle.internal.LifecycleModuleBuilder.buildProject(LifecycleModuleBuilder.java:84)
        at org.apache.maven.lifecycle.internal.LifecycleModuleBuilder.buildProject(LifecycleModuleBuilder.java:59)
        at org.apache.maven.lifecycle.internal.LifecycleStarter.singleThreadedBuild(LifecycleStarter.java:183)
        at org.apache.maven.lifecycle.internal.LifecycleStarter.execute(LifecycleStarter.java:161)
        at org.apache.maven.DefaultMaven.doExecute(DefaultMaven.java:320)
        at org.apache.maven.DefaultMaven.execute(DefaultMaven.java:156)
        at org.jvnet.hudson.maven3.launcher.Maven3Launcher.main(Maven3Launcher.java:117)
        at sun.reflect.NativeMethodAccessorImpl.invoke0(Native Method)
        at sun.reflect.NativeMethodAccessorImpl.invoke(NativeMethodAccessorImpl.java:57)
        at sun.reflect.DelegatingMethodAccessorImpl.invoke(DelegatingMethodAccessorImpl.java:43)
        at java.lang.reflect.Method.invoke(Method.java:606)
        at org.codehaus.plexus.classworlds.launcher.Launcher.launchStandard(Launcher.java:329)
        at org.codehaus.plexus.classworlds.launcher.Launcher.launch(Launcher.java:239)
        at org.jvnet.hudson.maven3.agent.Maven3Main.launch(Maven3Main.java:181)
        at sun.reflect.NativeMethodAccessorImpl.invoke0(Native Method)
        at sun.reflect.NativeMethodAccessorImpl.invoke(NativeMethodAccessorImpl.java:57)
        at sun.reflect.DelegatingMethodAccessorImpl.invoke(DelegatingMethodAccessorImpl.java:43)
        at java.lang.reflect.Method.invoke(Method.java:606)
        at hudson.maven.Maven3Builder.call(Maven3Builder.java:139)
        at hudson.maven.Maven3Builder.call(Maven3Builder.java:70)
        at hudson.remoting.UserRequest.perform(UserRequest.java:153)
        at hudson.remoting.UserRequest.perform(UserRequest.java:50)
        at hudson.remoting.Request$2.run(Request.java:336)
        at hudson.remoting.InterceptingExecutorService$1.call(InterceptingExecutorService.java:68)
        at java.util.concurrent.FutureTask.run(FutureTask.java:262)
        at java.util.concurrent.ThreadPoolExecutor.runWorker(ThreadPoolExecutor.java:1145)
        at java.util.concurrent.ThreadPoolExecutor$Worker.run(ThreadPoolExecutor.java:615)
        at java.lang.Thread.run(Thread.java:745)
Caused by: java.lang.UnsupportedClassVersionError: org/apache/karaf/tooling/features/GenerateDescriptorMojo : Unsupported major.minor version 52.0
        at java.lang.ClassLoader.defineClass1(Native Method)
        at java.lang.ClassLoader.defineClass(ClassLoader.java:800)
        at java.security.SecureClassLoader.defineClass(SecureClassLoader.java:142)
        at java.net.URLClassLoader.defineClass(URLClassLoader.java:449)
        at java.net.URLClassLoader.access$100(URLClassLoader.java:71)
        at java.net.URLClassLoader$1.run(URLClassLoader.java:361)
        at java.net.URLClassLoader$1.run(URLClassLoader.java:355)
        at java.security.AccessController.doPrivileged(Native Method)
        at java.net.URLClassLoader.findClass(URLClassLoader.java:354)
        at org.codehaus.plexus.classworlds.realm.ClassRealm.loadClassFromSelf(ClassRealm.java:386)
        at org.codehaus.plexus.classworlds.strategy.SelfFirstStrategy.loadClass(SelfFirstStrategy.java:42)
        at org.codehaus.plexus.classworlds.realm.ClassRealm.loadClass(ClassRealm.java:244)
        at org.codehaus.plexus.classworlds.realm.ClassRealm.loadClass(ClassRealm.java:230)
        at org.sonatype.guice.bean.reflect.URLClassSpace.loadClass(URLClassSpace.java:101)
        ... 52 more
java.lang.reflect.InvocationTargetException
        at sun.reflect.NativeMethodAccessorImpl.invoke0(Native Method)
        at sun.reflect.NativeMethodAccessorImpl.invoke(NativeMethodAccessorImpl.java:57)
        at sun.reflect.DelegatingMethodAccessorImpl.invoke(DelegatingMethodAccessorImpl.java:43)
        at java.lang.reflect.Method.invoke(Method.java:606)
        at org.codehaus.plexus.classworlds.launcher.Launcher.launchStandard(Launcher.java:329)
        at org.codehaus.plexus.classworlds.launcher.Launcher.launch(Launcher.java:239)
        at org.jvnet.hudson.maven3.agent.Maven3Main.launch(Maven3Main.java:181)
        at sun.reflect.NativeMethodAccessorImpl.invoke0(Native Method)
        at sun.reflect.NativeMethodAccessorImpl.invoke(NativeMethodAccessorImpl.java:57)
        at sun.reflect.DelegatingMethodAccessorImpl.invoke(DelegatingMethodAccessorImpl.java:43)
        at java.lang.reflect.Method.invoke(Method.java:606)
        at hudson.maven.Maven3Builder.call(Maven3Builder.java:139)
        at hudson.maven.Maven3Builder.call(Maven3Builder.java:70)
        at hudson.remoting.UserRequest.perform(UserRequest.java:153)
        at hudson.remoting.UserRequest.perform(UserRequest.java:50)
        at hudson.remoting.Request$2.run(Request.java:336)
        at hudson.remoting.InterceptingExecutorService$1.call(InterceptingExecutorService.java:68)
        at java.util.concurrent.FutureTask.run(FutureTask.java:262)
        at java.util.concurrent.ThreadPoolExecutor.runWorker(ThreadPoolExecutor.java:1145)
        at java.util.concurrent.ThreadPoolExecutor$Worker.run(ThreadPoolExecutor.java:615)
        at java.lang.Thread.run(Thread.java:745)
Caused by: java.lang.UnsupportedClassVersionError: org/apache/karaf/tooling/features/GenerateDescriptorMojo : Unsupported major.minor version 52.0
        at java.lang.ClassLoader.defineClass1(Native Method)
        at java.lang.ClassLoader.defineClass(ClassLoader.java:800)
        at java.security.SecureClassLoader.defineClass(SecureClassLoader.java:142)
        at java.net.URLClassLoader.defineClass(URLClassLoader.java:449)
        at java.net.URLClassLoader.access$100(URLClassLoader.java:71)
        at java.net.URLClassLoader$1.run(URLClassLoader.java:361)
        at java.net.URLClassLoader$1.run(URLClassLoader.java:355)
        at java.security.AccessController.doPrivileged(Native Method)
        at java.net.URLClassLoader.findClass(URLClassLoader.java:354)
        at org.codehaus.plexus.classworlds.realm.ClassRealm.loadClassFromSelf(ClassRealm.java:386)
        at org.codehaus.plexus.classworlds.strategy.SelfFirstStrategy.loadClass(SelfFirstStrategy.java:42)
        at org.codehaus.plexus.classworlds.realm.ClassRealm.loadClass(ClassRealm.java:244)
        at org.codehaus.plexus.classworlds.realm.ClassRealm.loadClass(ClassRealm.java:230)
        at hudson.maven.ExecutedMojo.getMojoClass(ExecutedMojo.java:126)
        at hudson.maven.ExecutedMojo.<init>(ExecutedMojo.java:99)
        at hudson.maven.Maven3Builder$MavenExecutionListener.recordExecutionTime(Maven3Builder.java:654)
        at hudson.maven.Maven3Builder$MavenExecutionListener.recordMojoEnded(Maven3Builder.java:618)
        at hudson.maven.Maven3Builder$MavenExecutionListener.mojoFailed(Maven3Builder.java:662)
        at org.apache.maven.lifecycle.internal.DefaultExecutionEventCatapult.fire(DefaultExecutionEventCatapult.java:90)
        at org.apache.maven.lifecycle.internal.MojoExecutor.execute(MojoExecutor.java:232)
        at org.apache.maven.lifecycle.internal.MojoExecutor.execute(MojoExecutor.java:153)
        at org.apache.maven.lifecycle.internal.MojoExecutor.execute(MojoExecutor.java:145)
        at org.apache.maven.lifecycle.internal.LifecycleModuleBuilder.buildProject(LifecycleModuleBuilder.java:84)
        at org.apache.maven.lifecycle.internal.LifecycleModuleBuilder.buildProject(LifecycleModuleBuilder.java:59)
        at org.apache.maven.lifecycle.internal.LifecycleStarter.singleThreadedBuild(LifecycleStarter.java:183)
        at org.apache.maven.lifecycle.internal.LifecycleStarter.execute(LifecycleStarter.java:161)
        at org.apache.maven.DefaultMaven.doExecute(DefaultMaven.java:320)
        at org.apache.maven.DefaultMaven.execute(DefaultMaven.java:156)
        at org.jvnet.hudson.maven3.launcher.Maven3Launcher.main(Maven3Launcher.java:117)
        ... 21 more
Sending e-mails to: [hidden email]
ERROR: Failed to parse POMs
java.io.IOException: java.lang.reflect.InvocationTargetException
        at hudson.maven.Maven3Builder.call(Maven3Builder.java:179)
        at hudson.maven.Maven3Builder.call(Maven3Builder.java:70)
        at hudson.remoting.UserRequest.perform(UserRequest.java:153)
        at hudson.remoting.UserRequest.perform(UserRequest.java:50)
        at hudson.remoting.Request$2.run(Request.java:336)
        at hudson.remoting.InterceptingExecutorService$1.call(InterceptingExecutorService.java:68)
        at java.util.concurrent.FutureTask.run(FutureTask.java:262)
        at java.util.concurrent.ThreadPoolExecutor.runWorker(ThreadPoolExecutor.java:1145)
        at java.util.concurrent.ThreadPoolExecutor$Worker.run(ThreadPoolExecutor.java:615)
        at java.lang.Thread.run(Thread.java:745)
        at ......remote call to Channel to Maven [/home/jenkins/tools/java/latest1.7/bin/java, -Xmx1280m, -XX:MaxPermSize=512m, -cp, /home/jenkins/jenkins-slave/maven3-agent.jar:/home/jenkins/tools/maven/apache-maven-3.0.4/boot/plexus-classworlds-2.4.jar, org.jvnet.hudson.maven3.agent.Maven3Main, /home/jenkins/tools/maven/apache-maven-3.0.4, /home/jenkins/jenkins-slave/slave.jar, /home/jenkins/jenkins-slave/maven3-interceptor.jar, /home/jenkins/jenkins-slave/maven3-interceptor-commons.jar, 32923](Native Method)
        at hudson.remoting.Channel.attachCallSiteStackTrace(Channel.java:1537)
        at hudson.remoting.UserResponse.retrieve(UserRequest.java:253)
        at hudson.remoting.Channel.call(Channel.java:822)
        at hudson.maven.ProcessCache$MavenProcess.call(ProcessCache.java:161)
        at hudson.maven.MavenModuleSetBuild$MavenModuleSetBuildExecution.doRun(MavenModuleSetBuild.java:873)
        at hudson.model.AbstractBuild$AbstractBuildExecution.run(AbstractBuild.java:534)
        at hudson.model.Run.execute(Run.java:1728)
        at hudson.maven.MavenModuleSetBuild.run(MavenModuleSetBuild.java:544)
        at hudson.model.ResourceController.execute(ResourceController.java:98)
        at hudson.model.Executor.run(Executor.java:404)
Caused by: java.lang.reflect.InvocationTargetException
        at sun.reflect.NativeMethodAccessorImpl.invoke0(Native Method)
        at sun.reflect.NativeMethodAccessorImpl.invoke(NativeMethodAccessorImpl.java:57)
        at sun.reflect.DelegatingMethodAccessorImpl.invoke(DelegatingMethodAccessorImpl.java:43)
        at java.lang.reflect.Method.invoke(Method.java:606)
        at hudson.maven.Maven3Builder.call(Maven3Builder.java:139)
        at hudson.maven.Maven3Builder.call(Maven3Builder.java:70)
        at hudson.remoting.UserRequest.perform(UserRequest.java:153)
        at hudson.remoting.UserRequest.perform(UserRequest.java:50)
        at hudson.remoting.Request$2.run(Request.java:336)
        at hudson.remoting.InterceptingExecutorService$1.call(InterceptingExecutorService.java:68)
        at java.util.concurrent.FutureTask.run(FutureTask.java:262)
        at java.util.concurrent.ThreadPoolExecutor.runWorker(ThreadPoolExecutor.java:1145)
        at java.util.concurrent.ThreadPoolExecutor$Worker.run(ThreadPoolExecutor.java:615)
        at java.lang.Thread.run(Thread.java:745)
Caused by: java.lang.Exception: java.lang.reflect.InvocationTargetException
        at org.jvnet.hudson.maven3.agent.Maven3Main.launch(Maven3Main.java:184)
        ... 14 more
Caused by: java.lang.reflect.InvocationTargetException
        at sun.reflect.NativeMethodAccessorImpl.invoke0(Native Method)
        at sun.reflect.NativeMethodAccessorImpl.invoke(NativeMethodAccessorImpl.java:57)
        at sun.reflect.DelegatingMethodAccessorImpl.invoke(DelegatingMethodAccessorImpl.java:43)
        at java.lang.reflect.Method.invoke(Method.java:606)
        at org.codehaus.plexus.classworlds.launcher.Launcher.launchStandard(Launcher.java:329)
        at org.codehaus.plexus.classworlds.launcher.Launcher.launch(Launcher.java:239)
        at org.jvnet.hudson.maven3.agent.Maven3Main.launch(Maven3Main.java:181)
        ... 14 more
Caused by: java.lang.UnsupportedClassVersionError: org/apache/karaf/tooling/features/GenerateDescriptorMojo : Unsupported major.minor version 52.0
        at java.lang.ClassLoader.defineClass1(Native Method)
        at java.lang.ClassLoader.defineClass(ClassLoader.java:800)
        at java.security.SecureClassLoader.defineClass(SecureClassLoader.java:142)
        at java.net.URLClassLoader.defineClass(URLClassLoader.java:449)
        at java.net.URLClassLoader.access$100(URLClassLoader.java:71)
        at java.net.URLClassLoader$1.run(URLClassLoader.java:361)
        at java.net.URLClassLoader$1.run(URLClassLoader.java:355)
        at java.security.AccessController.doPrivileged(Native Method)
        at java.net.URLClassLoader.findClass(URLClassLoader.java:354)
        at org.codehaus.plexus.classworlds.realm.ClassRealm.loadClassFromSelf(ClassRealm.java:386)
        at org.codehaus.plexus.classworlds.strategy.SelfFirstStrategy.loadClass(SelfFirstStrategy.java:42)
        at org.codehaus.plexus.classworlds.realm.ClassRealm.loadClass(ClassRealm.java:244)
        at org.codehaus.plexus.classworlds.realm.ClassRealm.loadClass(ClassRealm.java:230)
        at hudson.maven.ExecutedMojo.getMojoClass(ExecutedMojo.java:126)
        at hudson.maven.ExecutedMojo.<init>(ExecutedMojo.java:99)
        at hudson.maven.Maven3Builder$MavenExecutionListener.recordExecutionTime(Maven3Builder.java:654)
        at hudson.maven.Maven3Builder$MavenExecutionListener.recordMojoEnded(Maven3Builder.java:618)
        at hudson.maven.Maven3Builder$MavenExecutionListener.mojoFailed(Maven3Builder.java:662)
        at org.apache.maven.lifecycle.internal.DefaultExecutionEventCatapult.fire(DefaultExecutionEventCatapult.java:90)
        at org.apache.maven.lifecycle.internal.MojoExecutor.execute(MojoExecutor.java:232)
        at org.apache.maven.lifecycle.internal.MojoExecutor.execute(MojoExecutor.java:153)
        at org.apache.maven.lifecycle.internal.MojoExecutor.execute(MojoExecutor.java:145)
        at org.apache.maven.lifecycle.internal.LifecycleModuleBuilder.buildProject(LifecycleModuleBuilder.java:84)
        at org.apache.maven.lifecycle.internal.LifecycleModuleBuilder.buildProject(LifecycleModuleBuilder.java:59)
        at org.apache.maven.lifecycle.internal.LifecycleStarter.singleThreadedBuild(LifecycleStarter.java:183)
        at org.apache.maven.lifecycle.internal.LifecycleStarter.execute(LifecycleStarter.java:161)
        at org.apache.maven.DefaultMaven.doExecute(DefaultMaven.java:320)
        at org.apache.maven.DefaultMaven.execute(DefaultMaven.java:156)
        at org.jvnet.hudson.maven3.launcher.Maven3Launcher.main(Maven3Launcher.java:117)
        ... 21 more
channel stopped
Reply | Threaded
Open this post in threaded view
|  
Report Content as Inappropriate

Build failed in Jenkins: OpenJPA-trunk #1095

Apache Jenkins Server-2
See <https://builds.apache.org/job/OpenJPA-trunk/1095/display/redirect?page=changes>

Changes:

[cschneider] [OPENJPA-2690] Update OSGi Import-Package to support Oracle CLOB/BLOB

------------------------------------------
[...truncated 1.64 MB...]
[INFO] Excluding org.apache.geronimo.specs:geronimo-jpa_2.1_spec:jar:1.0-alpha-1 from the shaded jar.
[INFO] Excluding org.apache.geronimo.specs:geronimo-jta_1.1_spec:jar:1.1.1 from the shaded jar.
[INFO] Excluding org.apache.openjpa:openjpa-kernel:jar:3.0.0-SNAPSHOT from the shaded jar.
[INFO] Excluding org.apache.geronimo.specs:geronimo-jms_1.1_spec:jar:1.1.1 from the shaded jar.
[INFO] Excluding org.apache.xbean:xbean-asm5-shaded:jar:3.17 from the shaded jar.
[INFO] Excluding org.apache.openjpa:openjpa-lib:jar:3.0.0-SNAPSHOT from the shaded jar.
[INFO] Excluding commons-collections:commons-collections:jar:3.2.2 from the shaded jar.
[INFO] Excluding net.sourceforge.serp:serp:jar:1.15.1 from the shaded jar.
[INFO] Excluding org.apache.openjpa:openjpa-persistence-jdbc:jar:3.0.0-SNAPSHOT from the shaded jar.
[INFO] Excluding org.apache.openjpa:openjpa-jdbc:jar:3.0.0-SNAPSHOT from the shaded jar.
[INFO] Excluding org.apache.openjpa:openjpa-persistence:jar:3.0.0-SNAPSHOT from the shaded jar.
[INFO] Excluding commons-pool:commons-pool:jar:1.6 from the shaded jar.
[INFO] Replacing original artifact with shaded artifact.
[INFO] Replacing <https://builds.apache.org/job/OpenJPA-trunk/ws/trunk/openjpa-tools/openjpa-fetch-statistics-was/target/openjpa-fetch-statistics-was-3.0.0-SNAPSHOT.jar> with <https://builds.apache.org/job/OpenJPA-trunk/ws/trunk/openjpa-tools/openjpa-fetch-statistics-was/target/openjpa-fetch-statistics-was-3.0.0-SNAPSHOT-shaded.jar>
[INFO]
[INFO] --- apache-rat-plugin:0.11:check (default) @ openjpa-fetch-statistics-was ---
[INFO] 51 implicit excludes (use -debug for more details).
[INFO] Exclude: **/.*/**
[INFO] Exclude: **/target/**/*
[INFO] 1 resources included (use -debug for more details)
[INFO] Rat check: Summary of files. Unapproved: 0 unknown: 0 generated: 0 approved: 0 licence.
[INFO]
[INFO] --- maven-install-plugin:2.5.2:install (default-install) @ openjpa-fetch-statistics-was ---
[INFO] Installing <https://builds.apache.org/job/OpenJPA-trunk/ws/trunk/openjpa-tools/openjpa-fetch-statistics-was/target/openjpa-fetch-statistics-was-3.0.0-SNAPSHOT.jar> to /home/jenkins/jenkins-slave/maven-repositories/0/org/apache/openjpa/openjpa-fetch-statistics-was/3.0.0-SNAPSHOT/openjpa-fetch-statistics-was-3.0.0-SNAPSHOT.jar
[INFO] Installing <https://builds.apache.org/job/OpenJPA-trunk/ws/trunk/openjpa-tools/openjpa-fetch-statistics-was/dependency-reduced-pom.xml> to /home/jenkins/jenkins-slave/maven-repositories/0/org/apache/openjpa/openjpa-fetch-statistics-was/3.0.0-SNAPSHOT/openjpa-fetch-statistics-was-3.0.0-SNAPSHOT.pom
[INFO] Installing <https://builds.apache.org/job/OpenJPA-trunk/ws/trunk/openjpa-tools/openjpa-fetch-statistics-was/target/openjpa-fetch-statistics-was-3.0.0-SNAPSHOT-tests.jar> to /home/jenkins/jenkins-slave/maven-repositories/0/org/apache/openjpa/openjpa-fetch-statistics-was/3.0.0-SNAPSHOT/openjpa-fetch-statistics-was-3.0.0-SNAPSHOT-tests.jar
[INFO]                                                                        
[INFO] ------------------------------------------------------------------------
[INFO] Building OpenJPA Features 3.0.0-SNAPSHOT
[INFO] ------------------------------------------------------------------------
[INFO]
[INFO] --- maven-clean-plugin:3.0.0:clean (default-clean) @ openjpa-features ---
[INFO] Deleting <https://builds.apache.org/job/OpenJPA-trunk/ws/trunk/openjpa-features/target>
[INFO]
[INFO] --- buildnumber-maven-plugin:1.4:create (default) @ openjpa-features ---
[INFO]
[INFO] --- maven-enforcer-plugin:1.4.1:enforce (default) @ openjpa-features ---
[INFO]
[INFO] --- maven-checkstyle-plugin:2.9:checkstyle (default) @ openjpa-features ---
[INFO]
[INFO] --- maven-remote-resources-plugin:1.5:process (process-resource-bundles) @ openjpa-features ---
[INFO]
[INFO] --- karaf-maven-plugin:4.1.0:features-generate-descriptor (compile) @ openjpa-features ---
[WARNING] Error injecting: org.apache.karaf.tooling.features.GenerateDescriptorMojo
java.lang.TypeNotPresentException: Type org.apache.karaf.tooling.features.GenerateDescriptorMojo not present
        at org.sonatype.guice.bean.reflect.URLClassSpace.loadClass(URLClassSpace.java:109)
        at org.sonatype.guice.bean.reflect.NamedClass.load(NamedClass.java:45)
        at org.sonatype.guice.bean.reflect.AbstractDeferredClass.get(AbstractDeferredClass.java:45)
        at com.google.inject.internal.ProviderInternalFactory.provision(ProviderInternalFactory.java:84)
        at com.google.inject.internal.InternalFactoryToInitializableAdapter.provision(InternalFactoryToInitializableAdapter.java:52)
        at com.google.inject.internal.ProviderInternalFactory$1.call(ProviderInternalFactory.java:70)
        at com.google.inject.internal.ProvisionListenerStackCallback$Provision.provision(ProvisionListenerStackCallback.java:100)
        at org.sonatype.guice.plexus.lifecycles.PlexusLifecycleManager.onProvision(PlexusLifecycleManager.java:138)
        at com.google.inject.internal.ProvisionListenerStackCallback$Provision.provision(ProvisionListenerStackCallback.java:108)
        at com.google.inject.internal.ProvisionListenerStackCallback.provision(ProvisionListenerStackCallback.java:55)
        at com.google.inject.internal.ProviderInternalFactory.circularGet(ProviderInternalFactory.java:68)
        at com.google.inject.internal.InternalFactoryToInitializableAdapter.get(InternalFactoryToInitializableAdapter.java:45)
        at com.google.inject.internal.InjectorImpl$3$1.call(InjectorImpl.java:965)
        at com.google.inject.internal.InjectorImpl.callInContext(InjectorImpl.java:1011)
        at com.google.inject.internal.InjectorImpl$3.get(InjectorImpl.java:961)
        at com.google.inject.Scopes$1$1.get(Scopes.java:59)
        at org.sonatype.guice.bean.locators.LazyBeanEntry.getValue(LazyBeanEntry.java:83)
        at org.sonatype.guice.plexus.locators.LazyPlexusBean.getValue(LazyPlexusBean.java:49)
        at org.codehaus.plexus.DefaultPlexusContainer.lookup(DefaultPlexusContainer.java:253)
        at org.codehaus.plexus.DefaultPlexusContainer.lookup(DefaultPlexusContainer.java:245)
        at org.apache.maven.plugin.internal.DefaultMavenPluginManager.getConfiguredMojo(DefaultMavenPluginManager.java:455)
        at org.apache.maven.plugin.DefaultBuildPluginManager.executeMojo(DefaultBuildPluginManager.java:92)
        at org.apache.maven.lifecycle.internal.MojoExecutor.execute(MojoExecutor.java:209)
        at org.apache.maven.lifecycle.internal.MojoExecutor.execute(MojoExecutor.java:153)
        at org.apache.maven.lifecycle.internal.MojoExecutor.execute(MojoExecutor.java:145)
        at org.apache.maven.lifecycle.internal.LifecycleModuleBuilder.buildProject(LifecycleModuleBuilder.java:84)
        at org.apache.maven.lifecycle.internal.LifecycleModuleBuilder.buildProject(LifecycleModuleBuilder.java:59)
        at org.apache.maven.lifecycle.internal.LifecycleStarter.singleThreadedBuild(LifecycleStarter.java:183)
        at org.apache.maven.lifecycle.internal.LifecycleStarter.execute(LifecycleStarter.java:161)
        at org.apache.maven.DefaultMaven.doExecute(DefaultMaven.java:320)
        at org.apache.maven.DefaultMaven.execute(DefaultMaven.java:156)
        at org.jvnet.hudson.maven3.launcher.Maven3Launcher.main(Maven3Launcher.java:117)
        at sun.reflect.NativeMethodAccessorImpl.invoke0(Native Method)
        at sun.reflect.NativeMethodAccessorImpl.invoke(NativeMethodAccessorImpl.java:57)
        at sun.reflect.DelegatingMethodAccessorImpl.invoke(DelegatingMethodAccessorImpl.java:43)
        at java.lang.reflect.Method.invoke(Method.java:606)
        at org.codehaus.plexus.classworlds.launcher.Launcher.launchStandard(Launcher.java:329)
        at org.codehaus.plexus.classworlds.launcher.Launcher.launch(Launcher.java:239)
        at org.jvnet.hudson.maven3.agent.Maven3Main.launch(Maven3Main.java:181)
        at sun.reflect.NativeMethodAccessorImpl.invoke0(Native Method)
        at sun.reflect.NativeMethodAccessorImpl.invoke(NativeMethodAccessorImpl.java:57)
        at sun.reflect.DelegatingMethodAccessorImpl.invoke(DelegatingMethodAccessorImpl.java:43)
        at java.lang.reflect.Method.invoke(Method.java:606)
        at hudson.maven.Maven3Builder.call(Maven3Builder.java:139)
        at hudson.maven.Maven3Builder.call(Maven3Builder.java:70)
        at hudson.remoting.UserRequest.perform(UserRequest.java:153)
        at hudson.remoting.UserRequest.perform(UserRequest.java:50)
        at hudson.remoting.Request$2.run(Request.java:336)
        at hudson.remoting.InterceptingExecutorService$1.call(InterceptingExecutorService.java:68)
        at java.util.concurrent.FutureTask.run(FutureTask.java:262)
        at java.util.concurrent.ThreadPoolExecutor.runWorker(ThreadPoolExecutor.java:1145)
        at java.util.concurrent.ThreadPoolExecutor$Worker.run(ThreadPoolExecutor.java:615)
        at java.lang.Thread.run(Thread.java:745)
Caused by: java.lang.UnsupportedClassVersionError: org/apache/karaf/tooling/features/GenerateDescriptorMojo : Unsupported major.minor version 52.0
        at java.lang.ClassLoader.defineClass1(Native Method)
        at java.lang.ClassLoader.defineClass(ClassLoader.java:800)
        at java.security.SecureClassLoader.defineClass(SecureClassLoader.java:142)
        at java.net.URLClassLoader.defineClass(URLClassLoader.java:449)
        at java.net.URLClassLoader.access$100(URLClassLoader.java:71)
        at java.net.URLClassLoader$1.run(URLClassLoader.java:361)
        at java.net.URLClassLoader$1.run(URLClassLoader.java:355)
        at java.security.AccessController.doPrivileged(Native Method)
        at java.net.URLClassLoader.findClass(URLClassLoader.java:354)
        at org.codehaus.plexus.classworlds.realm.ClassRealm.loadClassFromSelf(ClassRealm.java:386)
        at org.codehaus.plexus.classworlds.strategy.SelfFirstStrategy.loadClass(SelfFirstStrategy.java:42)
        at org.codehaus.plexus.classworlds.realm.ClassRealm.loadClass(ClassRealm.java:244)
        at org.codehaus.plexus.classworlds.realm.ClassRealm.loadClass(ClassRealm.java:230)
        at org.sonatype.guice.bean.reflect.URLClassSpace.loadClass(URLClassSpace.java:101)
        ... 52 more
java.lang.reflect.InvocationTargetException
        at sun.reflect.NativeMethodAccessorImpl.invoke0(Native Method)
        at sun.reflect.NativeMethodAccessorImpl.invoke(NativeMethodAccessorImpl.java:57)
        at sun.reflect.DelegatingMethodAccessorImpl.invoke(DelegatingMethodAccessorImpl.java:43)
        at java.lang.reflect.Method.invoke(Method.java:606)
        at org.codehaus.plexus.classworlds.launcher.Launcher.launchStandard(Launcher.java:329)
        at org.codehaus.plexus.classworlds.launcher.Launcher.launch(Launcher.java:239)
        at org.jvnet.hudson.maven3.agent.Maven3Main.launch(Maven3Main.java:181)
        at sun.reflect.NativeMethodAccessorImpl.invoke0(Native Method)
        at sun.reflect.NativeMethodAccessorImpl.invoke(NativeMethodAccessorImpl.java:57)
        at sun.reflect.DelegatingMethodAccessorImpl.invoke(DelegatingMethodAccessorImpl.java:43)
        at java.lang.reflect.Method.invoke(Method.java:606)
        at hudson.maven.Maven3Builder.call(Maven3Builder.java:139)
        at hudson.maven.Maven3Builder.call(Maven3Builder.java:70)
        at hudson.remoting.UserRequest.perform(UserRequest.java:153)
        at hudson.remoting.UserRequest.perform(UserRequest.java:50)
        at hudson.remoting.Request$2.run(Request.java:336)
        at hudson.remoting.InterceptingExecutorService$1.call(InterceptingExecutorService.java:68)
        at java.util.concurrent.FutureTask.run(FutureTask.java:262)
        at java.util.concurrent.ThreadPoolExecutor.runWorker(ThreadPoolExecutor.java:1145)
        at java.util.concurrent.ThreadPoolExecutor$Worker.run(ThreadPoolExecutor.java:615)
        at java.lang.Thread.run(Thread.java:745)
Caused by: java.lang.UnsupportedClassVersionError: org/apache/karaf/tooling/features/GenerateDescriptorMojo : Unsupported major.minor version 52.0
        at java.lang.ClassLoader.defineClass1(Native Method)
        at java.lang.ClassLoader.defineClass(ClassLoader.java:800)
        at java.security.SecureClassLoader.defineClass(SecureClassLoader.java:142)
        at java.net.URLClassLoader.defineClass(URLClassLoader.java:449)
        at java.net.URLClassLoader.access$100(URLClassLoader.java:71)
        at java.net.URLClassLoader$1.run(URLClassLoader.java:361)
        at java.net.URLClassLoader$1.run(URLClassLoader.java:355)
        at java.security.AccessController.doPrivileged(Native Method)
        at java.net.URLClassLoader.findClass(URLClassLoader.java:354)
        at org.codehaus.plexus.classworlds.realm.ClassRealm.loadClassFromSelf(ClassRealm.java:386)
        at org.codehaus.plexus.classworlds.strategy.SelfFirstStrategy.loadClass(SelfFirstStrategy.java:42)
        at org.codehaus.plexus.classworlds.realm.ClassRealm.loadClass(ClassRealm.java:244)
        at org.codehaus.plexus.classworlds.realm.ClassRealm.loadClass(ClassRealm.java:230)
        at hudson.maven.ExecutedMojo.getMojoClass(ExecutedMojo.java:126)
        at hudson.maven.ExecutedMojo.<init>(ExecutedMojo.java:99)
        at hudson.maven.Maven3Builder$MavenExecutionListener.recordExecutionTime(Maven3Builder.java:654)
        at hudson.maven.Maven3Builder$MavenExecutionListener.recordMojoEnded(Maven3Builder.java:618)
        at hudson.maven.Maven3Builder$MavenExecutionListener.mojoFailed(Maven3Builder.java:662)
        at org.apache.maven.lifecycle.internal.DefaultExecutionEventCatapult.fire(DefaultExecutionEventCatapult.java:90)
        at org.apache.maven.lifecycle.internal.MojoExecutor.execute(MojoExecutor.java:232)
        at org.apache.maven.lifecycle.internal.MojoExecutor.execute(MojoExecutor.java:153)
        at org.apache.maven.lifecycle.internal.MojoExecutor.execute(MojoExecutor.java:145)
        at org.apache.maven.lifecycle.internal.LifecycleModuleBuilder.buildProject(LifecycleModuleBuilder.java:84)
        at org.apache.maven.lifecycle.internal.LifecycleModuleBuilder.buildProject(LifecycleModuleBuilder.java:59)
        at org.apache.maven.lifecycle.internal.LifecycleStarter.singleThreadedBuild(LifecycleStarter.java:183)
        at org.apache.maven.lifecycle.internal.LifecycleStarter.execute(LifecycleStarter.java:161)
        at org.apache.maven.DefaultMaven.doExecute(DefaultMaven.java:320)
        at org.apache.maven.DefaultMaven.execute(DefaultMaven.java:156)
        at org.jvnet.hudson.maven3.launcher.Maven3Launcher.main(Maven3Launcher.java:117)
        ... 21 more
ERROR: Failed to parse POMs
java.io.IOException: java.lang.reflect.InvocationTargetException
        at hudson.maven.Maven3Builder.call(Maven3Builder.java:179)
        at hudson.maven.Maven3Builder.call(Maven3Builder.java:70)
        at hudson.remoting.UserRequest.perform(UserRequest.java:153)
        at hudson.remoting.UserRequest.perform(UserRequest.java:50)
        at hudson.remoting.Request$2.run(Request.java:336)
        at hudson.remoting.InterceptingExecutorService$1.call(InterceptingExecutorService.java:68)
        at java.util.concurrent.FutureTask.run(FutureTask.java:262)
        at java.util.concurrent.ThreadPoolExecutor.runWorker(ThreadPoolExecutor.java:1145)
        at java.util.concurrent.ThreadPoolExecutor$Worker.run(ThreadPoolExecutor.java:615)
        at java.lang.Thread.run(Thread.java:745)
        at ......remote call to Channel to Maven [/home/jenkins/tools/java/latest1.7/bin/java, -Xmx1280m, -XX:MaxPermSize=512m, -cp, /home/jenkins/jenkins-slave/maven3-agent.jar:/home/jenkins/tools/maven/apache-maven-3.0.4/boot/plexus-classworlds-2.4.jar, org.jvnet.hudson.maven3.agent.Maven3Main, /home/jenkins/tools/maven/apache-maven-3.0.4, /home/jenkins/jenkins-slave/slave.jar, /home/jenkins/jenkins-slave/maven3-interceptor.jar, /home/jenkins/jenkins-slave/maven3-interceptor-commons.jar, 42686](Native Method)
        at hudson.remoting.Channel.attachCallSiteStackTrace(Channel.java:1537)
        at hudson.remoting.UserResponse.retrieve(UserRequest.java:253)
        at hudson.remoting.Channel.call(Channel.java:822)
        at hudson.maven.ProcessCache$MavenProcess.call(ProcessCache.java:161)
        at hudson.maven.MavenModuleSetBuild$MavenModuleSetBuildExecution.doRun(MavenModuleSetBuild.java:873)
        at hudson.model.AbstractBuild$AbstractBuildExecution.run(AbstractBuild.java:534)
        at hudson.model.Run.execute(Run.java:1728)
        at hudson.maven.MavenModuleSetBuild.run(MavenModuleSetBuild.java:544)
        at hudson.model.ResourceController.execute(ResourceController.java:98)
        at hudson.model.Executor.run(Executor.java:404)
Caused by: java.lang.reflect.InvocationTargetException
        at sun.reflect.NativeMethodAccessorImpl.invoke0(Native Method)
        at sun.reflect.NativeMethodAccessorImpl.invoke(NativeMethodAccessorImpl.java:57)
        at sun.reflect.DelegatingMethodAccessorImpl.invoke(DelegatingMethodAccessorImpl.java:43)
        at java.lang.reflect.Method.invoke(Method.java:606)
        at hudson.maven.Maven3Builder.call(Maven3Builder.java:139)
        at hudson.maven.Maven3Builder.call(Maven3Builder.java:70)
        at hudson.remoting.UserRequest.perform(UserRequest.java:153)
        at hudson.remoting.UserRequest.perform(UserRequest.java:50)
        at hudson.remoting.Request$2.run(Request.java:336)
        at hudson.remoting.InterceptingExecutorService$1.call(InterceptingExecutorService.java:68)
        at java.util.concurrent.FutureTask.run(FutureTask.java:262)
        at java.util.concurrent.ThreadPoolExecutor.runWorker(ThreadPoolExecutor.java:1145)
        at java.util.concurrent.ThreadPoolExecutor$Worker.run(ThreadPoolExecutor.java:615)
        at java.lang.Thread.run(Thread.java:745)
Caused by: java.lang.Exception: java.lang.reflect.InvocationTargetException
        at org.jvnet.hudson.maven3.agent.Maven3Main.launch(Maven3Main.java:184)
        ... 14 more
Caused by: java.lang.reflect.InvocationTargetException
        at sun.reflect.NativeMethodAccessorImpl.invoke0(Native Method)
        at sun.reflect.NativeMethodAccessorImpl.invoke(NativeMethodAccessorImpl.java:57)
        at sun.reflect.DelegatingMethodAccessorImpl.invoke(DelegatingMethodAccessorImpl.java:43)
        at java.lang.reflect.Method.invoke(Method.java:606)
        at org.codehaus.plexus.classworlds.launcher.Launcher.launchStandard(Launcher.java:329)
        at org.codehaus.plexus.classworlds.launcher.Launcher.launch(Launcher.java:239)
        at org.jvnet.hudson.maven3.agent.Maven3Main.launch(Maven3Main.java:181)
        ... 14 more
Caused by: java.lang.UnsupportedClassVersionError: org/apache/karaf/tooling/features/GenerateDescriptorMojo : Unsupported major.minor version 52.0
        at java.lang.ClassLoader.defineClass1(Native Method)
        at java.lang.ClassLoader.defineClass(ClassLoader.java:800)
        at java.security.SecureClassLoader.defineClass(SecureClassLoader.java:142)
        at java.net.URLClassLoader.defineClass(URLClassLoader.java:449)
        at java.net.URLClassLoader.access$100(URLClassLoader.java:71)
        at java.net.URLClassLoader$1.run(URLClassLoader.java:361)
        at java.net.URLClassLoader$1.run(URLClassLoader.java:355)
        at java.security.AccessController.doPrivileged(Native Method)
        at java.net.URLClassLoader.findClass(URLClassLoader.java:354)
        at org.codehaus.plexus.classworlds.realm.ClassRealm.loadClassFromSelf(ClassRealm.java:386)
        at org.codehaus.plexus.classworlds.strategy.SelfFirstStrategy.loadClass(SelfFirstStrategy.java:42)
        at org.codehaus.plexus.classworlds.realm.ClassRealm.loadClass(ClassRealm.java:244)
        at org.codehaus.plexus.classworlds.realm.ClassRealm.loadClass(ClassRealm.java:230)
        at hudson.maven.ExecutedMojo.getMojoClass(ExecutedMojo.java:126)
        at hudson.maven.ExecutedMojo.<init>(ExecutedMojo.java:99)
        at hudson.maven.Maven3Builder$MavenExecutionListener.recordExecutionTime(Maven3Builder.java:654)
        at hudson.maven.Maven3Builder$MavenExecutionListener.recordMojoEnded(Maven3Builder.java:618)
        at hudson.maven.Maven3Builder$MavenExecutionListener.mojoFailed(Maven3Builder.java:662)
        at org.apache.maven.lifecycle.internal.DefaultExecutionEventCatapult.fire(DefaultExecutionEventCatapult.java:90)
        at org.apache.maven.lifecycle.internal.MojoExecutor.execute(MojoExecutor.java:232)
        at org.apache.maven.lifecycle.internal.MojoExecutor.execute(MojoExecutor.java:153)
        at org.apache.maven.lifecycle.internal.MojoExecutor.execute(MojoExecutor.java:145)
        at org.apache.maven.lifecycle.internal.LifecycleModuleBuilder.buildProject(LifecycleModuleBuilder.java:84)
        at org.apache.maven.lifecycle.internal.LifecycleModuleBuilder.buildProject(LifecycleModuleBuilder.java:59)
        at org.apache.maven.lifecycle.internal.LifecycleStarter.singleThreadedBuild(LifecycleStarter.java:183)
        at org.apache.maven.lifecycle.internal.LifecycleStarter.execute(LifecycleStarter.java:161)
        at org.apache.maven.DefaultMaven.doExecute(DefaultMaven.java:320)
        at org.apache.maven.DefaultMaven.execute(DefaultMaven.java:156)
        at org.jvnet.hudson.maven3.launcher.Maven3Launcher.main(Maven3Launcher.java:117)
        ... 21 more
channel stopped
Reply | Threaded
Open this post in threaded view
|  
Report Content as Inappropriate

Build failed in Jenkins: OpenJPA-trunk #1096

Apache Jenkins Server-2
See <https://builds.apache.org/job/OpenJPA-trunk/1096/display/redirect?page=changes>

Changes:

[ilgrosso] [OPENJPA-2698] Applying the provided patch

------------------------------------------
[...truncated 1.64 MB...]
[INFO] Excluding org.apache.geronimo.specs:geronimo-jpa_2.1_spec:jar:1.0-alpha-1 from the shaded jar.
[INFO] Excluding org.apache.geronimo.specs:geronimo-jta_1.1_spec:jar:1.1.1 from the shaded jar.
[INFO] Excluding org.apache.openjpa:openjpa-kernel:jar:3.0.0-SNAPSHOT from the shaded jar.
[INFO] Excluding org.apache.geronimo.specs:geronimo-jms_1.1_spec:jar:1.1.1 from the shaded jar.
[INFO] Excluding org.apache.xbean:xbean-asm5-shaded:jar:3.17 from the shaded jar.
[INFO] Excluding org.apache.openjpa:openjpa-lib:jar:3.0.0-SNAPSHOT from the shaded jar.
[INFO] Excluding commons-collections:commons-collections:jar:3.2.2 from the shaded jar.
[INFO] Excluding net.sourceforge.serp:serp:jar:1.15.1 from the shaded jar.
[INFO] Excluding org.apache.openjpa:openjpa-persistence-jdbc:jar:3.0.0-SNAPSHOT from the shaded jar.
[INFO] Excluding org.apache.openjpa:openjpa-jdbc:jar:3.0.0-SNAPSHOT from the shaded jar.
[INFO] Excluding org.apache.openjpa:openjpa-persistence:jar:3.0.0-SNAPSHOT from the shaded jar.
[INFO] Excluding commons-pool:commons-pool:jar:1.6 from the shaded jar.
[INFO] Replacing original artifact with shaded artifact.
[INFO] Replacing <https://builds.apache.org/job/OpenJPA-trunk/ws/trunk/openjpa-tools/openjpa-fetch-statistics-was/target/openjpa-fetch-statistics-was-3.0.0-SNAPSHOT.jar> with <https://builds.apache.org/job/OpenJPA-trunk/ws/trunk/openjpa-tools/openjpa-fetch-statistics-was/target/openjpa-fetch-statistics-was-3.0.0-SNAPSHOT-shaded.jar>
[INFO]
[INFO] --- apache-rat-plugin:0.11:check (default) @ openjpa-fetch-statistics-was ---
[INFO] 51 implicit excludes (use -debug for more details).
[INFO] Exclude: **/.*/**
[INFO] Exclude: **/target/**/*
[INFO] 1 resources included (use -debug for more details)
[INFO] Rat check: Summary of files. Unapproved: 0 unknown: 0 generated: 0 approved: 0 licence.
[INFO]
[INFO] --- maven-install-plugin:2.5.2:install (default-install) @ openjpa-fetch-statistics-was ---
[INFO] Installing <https://builds.apache.org/job/OpenJPA-trunk/ws/trunk/openjpa-tools/openjpa-fetch-statistics-was/target/openjpa-fetch-statistics-was-3.0.0-SNAPSHOT.jar> to /home/jenkins/jenkins-slave/maven-repositories/0/org/apache/openjpa/openjpa-fetch-statistics-was/3.0.0-SNAPSHOT/openjpa-fetch-statistics-was-3.0.0-SNAPSHOT.jar
[INFO] Installing <https://builds.apache.org/job/OpenJPA-trunk/ws/trunk/openjpa-tools/openjpa-fetch-statistics-was/dependency-reduced-pom.xml> to /home/jenkins/jenkins-slave/maven-repositories/0/org/apache/openjpa/openjpa-fetch-statistics-was/3.0.0-SNAPSHOT/openjpa-fetch-statistics-was-3.0.0-SNAPSHOT.pom
[INFO] Installing <https://builds.apache.org/job/OpenJPA-trunk/ws/trunk/openjpa-tools/openjpa-fetch-statistics-was/target/openjpa-fetch-statistics-was-3.0.0-SNAPSHOT-tests.jar> to /home/jenkins/jenkins-slave/maven-repositories/0/org/apache/openjpa/openjpa-fetch-statistics-was/3.0.0-SNAPSHOT/openjpa-fetch-statistics-was-3.0.0-SNAPSHOT-tests.jar
[INFO]                                                                        
[INFO] ------------------------------------------------------------------------
[INFO] Building OpenJPA Features 3.0.0-SNAPSHOT
[INFO] ------------------------------------------------------------------------
[INFO]
[INFO] --- maven-clean-plugin:3.0.0:clean (default-clean) @ openjpa-features ---
[INFO] Deleting <https://builds.apache.org/job/OpenJPA-trunk/ws/trunk/openjpa-features/target>
[INFO]
[INFO] --- buildnumber-maven-plugin:1.4:create (default) @ openjpa-features ---
[INFO]
[INFO] --- maven-enforcer-plugin:1.4.1:enforce (default) @ openjpa-features ---
[INFO]
[INFO] --- maven-checkstyle-plugin:2.9:checkstyle (default) @ openjpa-features ---
[INFO]
[INFO] --- maven-remote-resources-plugin:1.5:process (process-resource-bundles) @ openjpa-features ---
[INFO]
[INFO] --- karaf-maven-plugin:4.1.0:features-generate-descriptor (compile) @ openjpa-features ---
[WARNING] Error injecting: org.apache.karaf.tooling.features.GenerateDescriptorMojo
java.lang.TypeNotPresentException: Type org.apache.karaf.tooling.features.GenerateDescriptorMojo not present
        at org.sonatype.guice.bean.reflect.URLClassSpace.loadClass(URLClassSpace.java:109)
        at org.sonatype.guice.bean.reflect.NamedClass.load(NamedClass.java:45)
        at org.sonatype.guice.bean.reflect.AbstractDeferredClass.get(AbstractDeferredClass.java:45)
        at com.google.inject.internal.ProviderInternalFactory.provision(ProviderInternalFactory.java:84)
        at com.google.inject.internal.InternalFactoryToInitializableAdapter.provision(InternalFactoryToInitializableAdapter.java:52)
        at com.google.inject.internal.ProviderInternalFactory$1.call(ProviderInternalFactory.java:70)
        at com.google.inject.internal.ProvisionListenerStackCallback$Provision.provision(ProvisionListenerStackCallback.java:100)
        at org.sonatype.guice.plexus.lifecycles.PlexusLifecycleManager.onProvision(PlexusLifecycleManager.java:138)
        at com.google.inject.internal.ProvisionListenerStackCallback$Provision.provision(ProvisionListenerStackCallback.java:108)
        at com.google.inject.internal.ProvisionListenerStackCallback.provision(ProvisionListenerStackCallback.java:55)
        at com.google.inject.internal.ProviderInternalFactory.circularGet(ProviderInternalFactory.java:68)
        at com.google.inject.internal.InternalFactoryToInitializableAdapter.get(InternalFactoryToInitializableAdapter.java:45)
        at com.google.inject.internal.InjectorImpl$3$1.call(InjectorImpl.java:965)
        at com.google.inject.internal.InjectorImpl.callInContext(InjectorImpl.java:1011)
        at com.google.inject.internal.InjectorImpl$3.get(InjectorImpl.java:961)
        at com.google.inject.Scopes$1$1.get(Scopes.java:59)
        at org.sonatype.guice.bean.locators.LazyBeanEntry.getValue(LazyBeanEntry.java:83)
        at org.sonatype.guice.plexus.locators.LazyPlexusBean.getValue(LazyPlexusBean.java:49)
        at org.codehaus.plexus.DefaultPlexusContainer.lookup(DefaultPlexusContainer.java:253)
        at org.codehaus.plexus.DefaultPlexusContainer.lookup(DefaultPlexusContainer.java:245)
        at org.apache.maven.plugin.internal.DefaultMavenPluginManager.getConfiguredMojo(DefaultMavenPluginManager.java:455)
        at org.apache.maven.plugin.DefaultBuildPluginManager.executeMojo(DefaultBuildPluginManager.java:92)
        at org.apache.maven.lifecycle.internal.MojoExecutor.execute(MojoExecutor.java:209)
        at org.apache.maven.lifecycle.internal.MojoExecutor.execute(MojoExecutor.java:153)
        at org.apache.maven.lifecycle.internal.MojoExecutor.execute(MojoExecutor.java:145)
        at org.apache.maven.lifecycle.internal.LifecycleModuleBuilder.buildProject(LifecycleModuleBuilder.java:84)
        at org.apache.maven.lifecycle.internal.LifecycleModuleBuilder.buildProject(LifecycleModuleBuilder.java:59)
        at org.apache.maven.lifecycle.internal.LifecycleStarter.singleThreadedBuild(LifecycleStarter.java:183)
        at org.apache.maven.lifecycle.internal.LifecycleStarter.execute(LifecycleStarter.java:161)
        at org.apache.maven.DefaultMaven.doExecute(DefaultMaven.java:320)
        at org.apache.maven.DefaultMaven.execute(DefaultMaven.java:156)
        at org.jvnet.hudson.maven3.launcher.Maven3Launcher.main(Maven3Launcher.java:117)
        at sun.reflect.NativeMethodAccessorImpl.invoke0(Native Method)
        at sun.reflect.NativeMethodAccessorImpl.invoke(NativeMethodAccessorImpl.java:57)
        at sun.reflect.DelegatingMethodAccessorImpl.invoke(DelegatingMethodAccessorImpl.java:43)
        at java.lang.reflect.Method.invoke(Method.java:606)
        at org.codehaus.plexus.classworlds.launcher.Launcher.launchStandard(Launcher.java:329)
        at org.codehaus.plexus.classworlds.launcher.Launcher.launch(Launcher.java:239)
        at org.jvnet.hudson.maven3.agent.Maven3Main.launch(Maven3Main.java:181)
        at sun.reflect.NativeMethodAccessorImpl.invoke0(Native Method)
        at sun.reflect.NativeMethodAccessorImpl.invoke(NativeMethodAccessorImpl.java:57)
        at sun.reflect.DelegatingMethodAccessorImpl.invoke(DelegatingMethodAccessorImpl.java:43)
        at java.lang.reflect.Method.invoke(Method.java:606)
        at hudson.maven.Maven3Builder.call(Maven3Builder.java:139)
        at hudson.maven.Maven3Builder.call(Maven3Builder.java:70)
        at hudson.remoting.UserRequest.perform(UserRequest.java:153)
        at hudson.remoting.UserRequest.perform(UserRequest.java:50)
        at hudson.remoting.Request$2.run(Request.java:336)
        at hudson.remoting.InterceptingExecutorService$1.call(InterceptingExecutorService.java:68)
        at java.util.concurrent.FutureTask.run(FutureTask.java:262)
        at java.util.concurrent.ThreadPoolExecutor.runWorker(ThreadPoolExecutor.java:1145)
        at java.util.concurrent.ThreadPoolExecutor$Worker.run(ThreadPoolExecutor.java:615)
        at java.lang.Thread.run(Thread.java:745)
Caused by: java.lang.UnsupportedClassVersionError: org/apache/karaf/tooling/features/GenerateDescriptorMojo : Unsupported major.minor version 52.0
        at java.lang.ClassLoader.defineClass1(Native Method)
        at java.lang.ClassLoader.defineClass(ClassLoader.java:800)
        at java.security.SecureClassLoader.defineClass(SecureClassLoader.java:142)
        at java.net.URLClassLoader.defineClass(URLClassLoader.java:449)
        at java.net.URLClassLoader.access$100(URLClassLoader.java:71)
        at java.net.URLClassLoader$1.run(URLClassLoader.java:361)
        at java.net.URLClassLoader$1.run(URLClassLoader.java:355)
        at java.security.AccessController.doPrivileged(Native Method)
        at java.net.URLClassLoader.findClass(URLClassLoader.java:354)
        at org.codehaus.plexus.classworlds.realm.ClassRealm.loadClassFromSelf(ClassRealm.java:386)
        at org.codehaus.plexus.classworlds.strategy.SelfFirstStrategy.loadClass(SelfFirstStrategy.java:42)
        at org.codehaus.plexus.classworlds.realm.ClassRealm.loadClass(ClassRealm.java:244)
        at org.codehaus.plexus.classworlds.realm.ClassRealm.loadClass(ClassRealm.java:230)
        at org.sonatype.guice.bean.reflect.URLClassSpace.loadClass(URLClassSpace.java:101)
        ... 52 more
java.lang.reflect.InvocationTargetException
        at sun.reflect.NativeMethodAccessorImpl.invoke0(Native Method)
        at sun.reflect.NativeMethodAccessorImpl.invoke(NativeMethodAccessorImpl.java:57)
        at sun.reflect.DelegatingMethodAccessorImpl.invoke(DelegatingMethodAccessorImpl.java:43)
        at java.lang.reflect.Method.invoke(Method.java:606)
        at org.codehaus.plexus.classworlds.launcher.Launcher.launchStandard(Launcher.java:329)
        at org.codehaus.plexus.classworlds.launcher.Launcher.launch(Launcher.java:239)
        at org.jvnet.hudson.maven3.agent.Maven3Main.launch(Maven3Main.java:181)
        at sun.reflect.NativeMethodAccessorImpl.invoke0(Native Method)
        at sun.reflect.NativeMethodAccessorImpl.invoke(NativeMethodAccessorImpl.java:57)
        at sun.reflect.DelegatingMethodAccessorImpl.invoke(DelegatingMethodAccessorImpl.java:43)
        at java.lang.reflect.Method.invoke(Method.java:606)
        at hudson.maven.Maven3Builder.call(Maven3Builder.java:139)
        at hudson.maven.Maven3Builder.call(Maven3Builder.java:70)
        at hudson.remoting.UserRequest.perform(UserRequest.java:153)
        at hudson.remoting.UserRequest.perform(UserRequest.java:50)
        at hudson.remoting.Request$2.run(Request.java:336)
        at hudson.remoting.InterceptingExecutorService$1.call(InterceptingExecutorService.java:68)
        at java.util.concurrent.FutureTask.run(FutureTask.java:262)
        at java.util.concurrent.ThreadPoolExecutor.runWorker(ThreadPoolExecutor.java:1145)
        at java.util.concurrent.ThreadPoolExecutor$Worker.run(ThreadPoolExecutor.java:615)
        at java.lang.Thread.run(Thread.java:745)
Caused by: java.lang.UnsupportedClassVersionError: org/apache/karaf/tooling/features/GenerateDescriptorMojo : Unsupported major.minor version 52.0
        at java.lang.ClassLoader.defineClass1(Native Method)
        at java.lang.ClassLoader.defineClass(ClassLoader.java:800)
        at java.security.SecureClassLoader.defineClass(SecureClassLoader.java:142)
        at java.net.URLClassLoader.defineClass(URLClassLoader.java:449)
        at java.net.URLClassLoader.access$100(URLClassLoader.java:71)
        at java.net.URLClassLoader$1.run(URLClassLoader.java:361)
        at java.net.URLClassLoader$1.run(URLClassLoader.java:355)
        at java.security.AccessController.doPrivileged(Native Method)
        at java.net.URLClassLoader.findClass(URLClassLoader.java:354)
        at org.codehaus.plexus.classworlds.realm.ClassRealm.loadClassFromSelf(ClassRealm.java:386)
        at org.codehaus.plexus.classworlds.strategy.SelfFirstStrategy.loadClass(SelfFirstStrategy.java:42)
        at org.codehaus.plexus.classworlds.realm.ClassRealm.loadClass(ClassRealm.java:244)
        at org.codehaus.plexus.classworlds.realm.ClassRealm.loadClass(ClassRealm.java:230)
        at hudson.maven.ExecutedMojo.getMojoClass(ExecutedMojo.java:126)
        at hudson.maven.ExecutedMojo.<init>(ExecutedMojo.java:99)
        at hudson.maven.Maven3Builder$MavenExecutionListener.recordExecutionTime(Maven3Builder.java:654)
        at hudson.maven.Maven3Builder$MavenExecutionListener.recordMojoEnded(Maven3Builder.java:618)
        at hudson.maven.Maven3Builder$MavenExecutionListener.mojoFailed(Maven3Builder.java:662)
        at org.apache.maven.lifecycle.internal.DefaultExecutionEventCatapult.fire(DefaultExecutionEventCatapult.java:90)
        at org.apache.maven.lifecycle.internal.MojoExecutor.execute(MojoExecutor.java:232)
        at org.apache.maven.lifecycle.internal.MojoExecutor.execute(MojoExecutor.java:153)
        at org.apache.maven.lifecycle.internal.MojoExecutor.execute(MojoExecutor.java:145)
        at org.apache.maven.lifecycle.internal.LifecycleModuleBuilder.buildProject(LifecycleModuleBuilder.java:84)
        at org.apache.maven.lifecycle.internal.LifecycleModuleBuilder.buildProject(LifecycleModuleBuilder.java:59)
        at org.apache.maven.lifecycle.internal.LifecycleStarter.singleThreadedBuild(LifecycleStarter.java:183)
        at org.apache.maven.lifecycle.internal.LifecycleStarter.execute(LifecycleStarter.java:161)
        at org.apache.maven.DefaultMaven.doExecute(DefaultMaven.java:320)
        at org.apache.maven.DefaultMaven.execute(DefaultMaven.java:156)
        at org.jvnet.hudson.maven3.launcher.Maven3Launcher.main(Maven3Launcher.java:117)
        ... 21 more
ERROR: Failed to parse POMs
java.io.IOException: java.lang.reflect.InvocationTargetException
        at hudson.maven.Maven3Builder.call(Maven3Builder.java:179)
        at hudson.maven.Maven3Builder.call(Maven3Builder.java:70)
        at hudson.remoting.UserRequest.perform(UserRequest.java:153)
        at hudson.remoting.UserRequest.perform(UserRequest.java:50)
        at hudson.remoting.Request$2.run(Request.java:336)
        at hudson.remoting.InterceptingExecutorService$1.call(InterceptingExecutorService.java:68)
        at java.util.concurrent.FutureTask.run(FutureTask.java:262)
        at java.util.concurrent.ThreadPoolExecutor.runWorker(ThreadPoolExecutor.java:1145)
        at java.util.concurrent.ThreadPoolExecutor$Worker.run(ThreadPoolExecutor.java:615)
        at java.lang.Thread.run(Thread.java:745)
        at ......remote call to Channel to Maven [/home/jenkins/tools/java/latest1.7/bin/java, -Xmx1280m, -XX:MaxPermSize=512m, -cp, /home/jenkins/jenkins-slave/maven3-agent.jar:/home/jenkins/tools/maven/apache-maven-3.0.4/boot/plexus-classworlds-2.4.jar, org.jvnet.hudson.maven3.agent.Maven3Main, /home/jenkins/tools/maven/apache-maven-3.0.4, /home/jenkins/jenkins-slave/slave.jar, /home/jenkins/jenkins-slave/maven3-interceptor.jar, /home/jenkins/jenkins-slave/maven3-interceptor-commons.jar, 39837](Native Method)
        at hudson.remoting.Channel.attachCallSiteStackTrace(Channel.java:1545)
        at hudson.remoting.UserResponse.retrieve(UserRequest.java:253)
        at hudson.remoting.Channel.call(Channel.java:830)
        at hudson.maven.ProcessCache$MavenProcess.call(ProcessCache.java:161)
        at hudson.maven.MavenModuleSetBuild$MavenModuleSetBuildExecution.doRun(MavenModuleSetBuild.java:873)
        at hudson.model.AbstractBuild$AbstractBuildExecution.run(AbstractBuild.java:534)
        at hudson.model.Run.execute(Run.java:1728)
        at hudson.maven.MavenModuleSetBuild.run(MavenModuleSetBuild.java:544)
        at hudson.model.ResourceController.execute(ResourceController.java:98)
        at hudson.model.Executor.run(Executor.java:405)
Caused by: java.lang.reflect.InvocationTargetException
        at sun.reflect.NativeMethodAccessorImpl.invoke0(Native Method)
        at sun.reflect.NativeMethodAccessorImpl.invoke(NativeMethodAccessorImpl.java:57)
        at sun.reflect.DelegatingMethodAccessorImpl.invoke(DelegatingMethodAccessorImpl.java:43)
        at java.lang.reflect.Method.invoke(Method.java:606)
        at hudson.maven.Maven3Builder.call(Maven3Builder.java:139)
        at hudson.maven.Maven3Builder.call(Maven3Builder.java:70)
        at hudson.remoting.UserRequest.perform(UserRequest.java:153)
        at hudson.remoting.UserRequest.perform(UserRequest.java:50)
        at hudson.remoting.Request$2.run(Request.java:336)
        at hudson.remoting.InterceptingExecutorService$1.call(InterceptingExecutorService.java:68)
        at java.util.concurrent.FutureTask.run(FutureTask.java:262)
        at java.util.concurrent.ThreadPoolExecutor.runWorker(ThreadPoolExecutor.java:1145)
        at java.util.concurrent.ThreadPoolExecutor$Worker.run(ThreadPoolExecutor.java:615)
        at java.lang.Thread.run(Thread.java:745)
Caused by: java.lang.Exception: java.lang.reflect.InvocationTargetException
        at org.jvnet.hudson.maven3.agent.Maven3Main.launch(Maven3Main.java:184)
        ... 14 more
Caused by: java.lang.reflect.InvocationTargetException
        at sun.reflect.NativeMethodAccessorImpl.invoke0(Native Method)
        at sun.reflect.NativeMethodAccessorImpl.invoke(NativeMethodAccessorImpl.java:57)
        at sun.reflect.DelegatingMethodAccessorImpl.invoke(DelegatingMethodAccessorImpl.java:43)
        at java.lang.reflect.Method.invoke(Method.java:606)
        at org.codehaus.plexus.classworlds.launcher.Launcher.launchStandard(Launcher.java:329)
        at org.codehaus.plexus.classworlds.launcher.Launcher.launch(Launcher.java:239)
        at org.jvnet.hudson.maven3.agent.Maven3Main.launch(Maven3Main.java:181)
        ... 14 more
Caused by: java.lang.UnsupportedClassVersionError: org/apache/karaf/tooling/features/GenerateDescriptorMojo : Unsupported major.minor version 52.0
        at java.lang.ClassLoader.defineClass1(Native Method)
        at java.lang.ClassLoader.defineClass(ClassLoader.java:800)
        at java.security.SecureClassLoader.defineClass(SecureClassLoader.java:142)
        at java.net.URLClassLoader.defineClass(URLClassLoader.java:449)
        at java.net.URLClassLoader.access$100(URLClassLoader.java:71)
        at java.net.URLClassLoader$1.run(URLClassLoader.java:361)
        at java.net.URLClassLoader$1.run(URLClassLoader.java:355)
        at java.security.AccessController.doPrivileged(Native Method)
        at java.net.URLClassLoader.findClass(URLClassLoader.java:354)
        at org.codehaus.plexus.classworlds.realm.ClassRealm.loadClassFromSelf(ClassRealm.java:386)
        at org.codehaus.plexus.classworlds.strategy.SelfFirstStrategy.loadClass(SelfFirstStrategy.java:42)
        at org.codehaus.plexus.classworlds.realm.ClassRealm.loadClass(ClassRealm.java:244)
        at org.codehaus.plexus.classworlds.realm.ClassRealm.loadClass(ClassRealm.java:230)
        at hudson.maven.ExecutedMojo.getMojoClass(ExecutedMojo.java:126)
        at hudson.maven.ExecutedMojo.<init>(ExecutedMojo.java:99)
        at hudson.maven.Maven3Builder$MavenExecutionListener.recordExecutionTime(Maven3Builder.java:654)
        at hudson.maven.Maven3Builder$MavenExecutionListener.recordMojoEnded(Maven3Builder.java:618)
        at hudson.maven.Maven3Builder$MavenExecutionListener.mojoFailed(Maven3Builder.java:662)
        at org.apache.maven.lifecycle.internal.DefaultExecutionEventCatapult.fire(DefaultExecutionEventCatapult.java:90)
        at org.apache.maven.lifecycle.internal.MojoExecutor.execute(MojoExecutor.java:232)
        at org.apache.maven.lifecycle.internal.MojoExecutor.execute(MojoExecutor.java:153)
        at org.apache.maven.lifecycle.internal.MojoExecutor.execute(MojoExecutor.java:145)
        at org.apache.maven.lifecycle.internal.LifecycleModuleBuilder.buildProject(LifecycleModuleBuilder.java:84)
        at org.apache.maven.lifecycle.internal.LifecycleModuleBuilder.buildProject(LifecycleModuleBuilder.java:59)
        at org.apache.maven.lifecycle.internal.LifecycleStarter.singleThreadedBuild(LifecycleStarter.java:183)
        at org.apache.maven.lifecycle.internal.LifecycleStarter.execute(LifecycleStarter.java:161)
        at org.apache.maven.DefaultMaven.doExecute(DefaultMaven.java:320)
        at org.apache.maven.DefaultMaven.execute(DefaultMaven.java:156)
        at org.jvnet.hudson.maven3.launcher.Maven3Launcher.main(Maven3Launcher.java:117)
        ... 21 more
channel stopped
Reply | Threaded
Open this post in threaded view
|  
Report Content as Inappropriate

Build failed in Jenkins: OpenJPA-trunk #1097

Apache Jenkins Server-2
See <https://builds.apache.org/job/OpenJPA-trunk/1097/display/redirect?page=changes>

Changes:

[ilgrosso] Reverting unadverted change to JPQLExpressionBuilder in r1797211

[ilgrosso] changed version of maven-jar-plugin to 3.0.2 - This closes #8

------------------------------------------
[...truncated 2.25 MB...]
[INFO] Excluding org.apache.openjpa:openjpa-kernel:jar:3.0.0-SNAPSHOT from the shaded jar.
[INFO] Excluding org.apache.geronimo.specs:geronimo-jms_1.1_spec:jar:1.1.1 from the shaded jar.
[INFO] Excluding org.apache.xbean:xbean-asm5-shaded:jar:3.17 from the shaded jar.
[INFO] Excluding org.apache.openjpa:openjpa-lib:jar:3.0.0-SNAPSHOT from the shaded jar.
[INFO] Excluding commons-collections:commons-collections:jar:3.2.2 from the shaded jar.
[INFO] Excluding net.sourceforge.serp:serp:jar:1.15.1 from the shaded jar.
[INFO] Excluding org.apache.openjpa:openjpa-persistence-jdbc:jar:3.0.0-SNAPSHOT from the shaded jar.
[INFO] Excluding org.apache.openjpa:openjpa-jdbc:jar:3.0.0-SNAPSHOT from the shaded jar.
[INFO] Excluding org.apache.openjpa:openjpa-persistence:jar:3.0.0-SNAPSHOT from the shaded jar.
[INFO] Excluding commons-pool:commons-pool:jar:1.6 from the shaded jar.
[INFO] Replacing original artifact with shaded artifact.
[INFO] Replacing <https://builds.apache.org/job/OpenJPA-trunk/ws/trunk/openjpa-tools/openjpa-fetch-statistics-was/target/openjpa-fetch-statistics-was-3.0.0-SNAPSHOT.jar> with <https://builds.apache.org/job/OpenJPA-trunk/ws/trunk/openjpa-tools/openjpa-fetch-statistics-was/target/openjpa-fetch-statistics-was-3.0.0-SNAPSHOT-shaded.jar>
[INFO]
[INFO] --- apache-rat-plugin:0.11:check (default) @ openjpa-fetch-statistics-was ---
[INFO] 51 implicit excludes (use -debug for more details).
[INFO] Exclude: **/.*/**
[INFO] Exclude: **/target/**/*
[INFO] 1 resources included (use -debug for more details)
[INFO] Rat check: Summary of files. Unapproved: 0 unknown: 0 generated: 0 approved: 0 licence.
[INFO]
[INFO] --- maven-install-plugin:2.5.2:install (default-install) @ openjpa-fetch-statistics-was ---
[INFO] Installing <https://builds.apache.org/job/OpenJPA-trunk/ws/trunk/openjpa-tools/openjpa-fetch-statistics-was/target/openjpa-fetch-statistics-was-3.0.0-SNAPSHOT.jar> to /home/jenkins/jenkins-slave/maven-repositories/1/org/apache/openjpa/openjpa-fetch-statistics-was/3.0.0-SNAPSHOT/openjpa-fetch-statistics-was-3.0.0-SNAPSHOT.jar
[INFO] Installing <https://builds.apache.org/job/OpenJPA-trunk/ws/trunk/openjpa-tools/openjpa-fetch-statistics-was/dependency-reduced-pom.xml> to /home/jenkins/jenkins-slave/maven-repositories/1/org/apache/openjpa/openjpa-fetch-statistics-was/3.0.0-SNAPSHOT/openjpa-fetch-statistics-was-3.0.0-SNAPSHOT.pom
[INFO] Installing <https://builds.apache.org/job/OpenJPA-trunk/ws/trunk/openjpa-tools/openjpa-fetch-statistics-was/target/openjpa-fetch-statistics-was-3.0.0-SNAPSHOT-tests.jar> to /home/jenkins/jenkins-slave/maven-repositories/1/org/apache/openjpa/openjpa-fetch-statistics-was/3.0.0-SNAPSHOT/openjpa-fetch-statistics-was-3.0.0-SNAPSHOT-tests.jar
[INFO]                                                                        
[INFO] ------------------------------------------------------------------------
[INFO] Building OpenJPA Features 3.0.0-SNAPSHOT
[INFO] ------------------------------------------------------------------------
Downloading: http://repo.maven.apache.org/maven2/org/apache/karaf/tooling/karaf-maven-plugin/maven-metadata.xml
Downloaded: http://repo.maven.apache.org/maven2/org/apache/karaf/tooling/karaf-maven-plugin/maven-metadata.xml (2 KB at 5.3 KB/sec)
[INFO]
[INFO] --- maven-clean-plugin:3.0.0:clean (default-clean) @ openjpa-features ---
[INFO]
[INFO] --- buildnumber-maven-plugin:1.4:create (default) @ openjpa-features ---
[INFO]
[INFO] --- maven-enforcer-plugin:1.4.1:enforce (default) @ openjpa-features ---
[INFO]
[INFO] --- maven-checkstyle-plugin:2.9:checkstyle (default) @ openjpa-features ---
[INFO]
[INFO] --- maven-remote-resources-plugin:1.5:process (process-resource-bundles) @ openjpa-features ---
[INFO]
[INFO] --- karaf-maven-plugin:4.1.1:features-generate-descriptor (compile) @ openjpa-features ---
[WARNING] Error injecting: org.apache.karaf.tooling.features.GenerateDescriptorMojo
java.lang.TypeNotPresentException: Type org.apache.karaf.tooling.features.GenerateDescriptorMojo not present
        at org.sonatype.guice.bean.reflect.URLClassSpace.loadClass(URLClassSpace.java:109)
        at org.sonatype.guice.bean.reflect.NamedClass.load(NamedClass.java:45)
        at org.sonatype.guice.bean.reflect.AbstractDeferredClass.get(AbstractDeferredClass.java:45)
        at com.google.inject.internal.ProviderInternalFactory.provision(ProviderInternalFactory.java:84)
        at com.google.inject.internal.InternalFactoryToInitializableAdapter.provision(InternalFactoryToInitializableAdapter.java:52)
        at com.google.inject.internal.ProviderInternalFactory$1.call(ProviderInternalFactory.java:70)
        at com.google.inject.internal.ProvisionListenerStackCallback$Provision.provision(ProvisionListenerStackCallback.java:100)
        at org.sonatype.guice.plexus.lifecycles.PlexusLifecycleManager.onProvision(PlexusLifecycleManager.java:138)
        at com.google.inject.internal.ProvisionListenerStackCallback$Provision.provision(ProvisionListenerStackCallback.java:108)
        at com.google.inject.internal.ProvisionListenerStackCallback.provision(ProvisionListenerStackCallback.java:55)
        at com.google.inject.internal.ProviderInternalFactory.circularGet(ProviderInternalFactory.java:68)
        at com.google.inject.internal.InternalFactoryToInitializableAdapter.get(InternalFactoryToInitializableAdapter.java:45)
        at com.google.inject.internal.InjectorImpl$3$1.call(InjectorImpl.java:965)
        at com.google.inject.internal.InjectorImpl.callInContext(InjectorImpl.java:1011)
        at com.google.inject.internal.InjectorImpl$3.get(InjectorImpl.java:961)
        at com.google.inject.Scopes$1$1.get(Scopes.java:59)
        at org.sonatype.guice.bean.locators.LazyBeanEntry.getValue(LazyBeanEntry.java:83)
        at org.sonatype.guice.plexus.locators.LazyPlexusBean.getValue(LazyPlexusBean.java:49)
        at org.codehaus.plexus.DefaultPlexusContainer.lookup(DefaultPlexusContainer.java:253)
        at org.codehaus.plexus.DefaultPlexusContainer.lookup(DefaultPlexusContainer.java:245)
        at org.apache.maven.plugin.internal.DefaultMavenPluginManager.getConfiguredMojo(DefaultMavenPluginManager.java:455)
        at org.apache.maven.plugin.DefaultBuildPluginManager.executeMojo(DefaultBuildPluginManager.java:92)
        at org.apache.maven.lifecycle.internal.MojoExecutor.execute(MojoExecutor.java:209)
        at org.apache.maven.lifecycle.internal.MojoExecutor.execute(MojoExecutor.java:153)
        at org.apache.maven.lifecycle.internal.MojoExecutor.execute(MojoExecutor.java:145)
        at org.apache.maven.lifecycle.internal.LifecycleModuleBuilder.buildProject(LifecycleModuleBuilder.java:84)
        at org.apache.maven.lifecycle.internal.LifecycleModuleBuilder.buildProject(LifecycleModuleBuilder.java:59)
        at org.apache.maven.lifecycle.internal.LifecycleStarter.singleThreadedBuild(LifecycleStarter.java:183)
        at org.apache.maven.lifecycle.internal.LifecycleStarter.execute(LifecycleStarter.java:161)
        at org.apache.maven.DefaultMaven.doExecute(DefaultMaven.java:320)
        at org.apache.maven.DefaultMaven.execute(DefaultMaven.java:156)
        at org.jvnet.hudson.maven3.launcher.Maven3Launcher.main(Maven3Launcher.java:117)
        at sun.reflect.NativeMethodAccessorImpl.invoke0(Native Method)
        at sun.reflect.NativeMethodAccessorImpl.invoke(NativeMethodAccessorImpl.java:57)
        at sun.reflect.DelegatingMethodAccessorImpl.invoke(DelegatingMethodAccessorImpl.java:43)
        at java.lang.reflect.Method.invoke(Method.java:606)
        at org.codehaus.plexus.classworlds.launcher.Launcher.launchStandard(Launcher.java:329)
        at org.codehaus.plexus.classworlds.launcher.Launcher.launch(Launcher.java:239)
        at org.jvnet.hudson.maven3.agent.Maven3Main.launch(Maven3Main.java:181)
        at sun.reflect.NativeMethodAccessorImpl.invoke0(Native Method)
        at sun.reflect.NativeMethodAccessorImpl.invoke(NativeMethodAccessorImpl.java:57)
        at sun.reflect.DelegatingMethodAccessorImpl.invoke(DelegatingMethodAccessorImpl.java:43)
        at java.lang.reflect.Method.invoke(Method.java:606)
        at hudson.maven.Maven3Builder.call(Maven3Builder.java:139)
        at hudson.maven.Maven3Builder.call(Maven3Builder.java:70)
        at hudson.remoting.UserRequest.perform(UserRequest.java:153)
        at hudson.remoting.UserRequest.perform(UserRequest.java:50)
        at hudson.remoting.Request$2.run(Request.java:336)
        at hudson.remoting.InterceptingExecutorService$1.call(InterceptingExecutorService.java:68)
        at java.util.concurrent.FutureTask.run(FutureTask.java:262)
        at java.util.concurrent.ThreadPoolExecutor.runWorker(ThreadPoolExecutor.java:1145)
        at java.util.concurrent.ThreadPoolExecutor$Worker.run(ThreadPoolExecutor.java:615)
        at java.lang.Thread.run(Thread.java:745)
Caused by: java.lang.UnsupportedClassVersionError: org/apache/karaf/tooling/features/GenerateDescriptorMojo : Unsupported major.minor version 52.0
        at java.lang.ClassLoader.defineClass1(Native Method)
        at java.lang.ClassLoader.defineClass(ClassLoader.java:800)
        at java.security.SecureClassLoader.defineClass(SecureClassLoader.java:142)
        at java.net.URLClassLoader.defineClass(URLClassLoader.java:449)
        at java.net.URLClassLoader.access$100(URLClassLoader.java:71)
        at java.net.URLClassLoader$1.run(URLClassLoader.java:361)
        at java.net.URLClassLoader$1.run(URLClassLoader.java:355)
        at java.security.AccessController.doPrivileged(Native Method)
        at java.net.URLClassLoader.findClass(URLClassLoader.java:354)
        at org.codehaus.plexus.classworlds.realm.ClassRealm.loadClassFromSelf(ClassRealm.java:386)
        at org.codehaus.plexus.classworlds.strategy.SelfFirstStrategy.loadClass(SelfFirstStrategy.java:42)
        at org.codehaus.plexus.classworlds.realm.ClassRealm.loadClass(ClassRealm.java:244)
        at org.codehaus.plexus.classworlds.realm.ClassRealm.loadClass(ClassRealm.java:230)
        at org.sonatype.guice.bean.reflect.URLClassSpace.loadClass(URLClassSpace.java:101)
        ... 52 more
java.lang.reflect.InvocationTargetException
        at sun.reflect.NativeMethodAccessorImpl.invoke0(Native Method)
        at sun.reflect.NativeMethodAccessorImpl.invoke(NativeMethodAccessorImpl.java:57)
        at sun.reflect.DelegatingMethodAccessorImpl.invoke(DelegatingMethodAccessorImpl.java:43)
        at java.lang.reflect.Method.invoke(Method.java:606)
        at org.codehaus.plexus.classworlds.launcher.Launcher.launchStandard(Launcher.java:329)
        at org.codehaus.plexus.classworlds.launcher.Launcher.launch(Launcher.java:239)
        at org.jvnet.hudson.maven3.agent.Maven3Main.launch(Maven3Main.java:181)
        at sun.reflect.NativeMethodAccessorImpl.invoke0(Native Method)
        at sun.reflect.NativeMethodAccessorImpl.invoke(NativeMethodAccessorImpl.java:57)
        at sun.reflect.DelegatingMethodAccessorImpl.invoke(DelegatingMethodAccessorImpl.java:43)
        at java.lang.reflect.Method.invoke(Method.java:606)
        at hudson.maven.Maven3Builder.call(Maven3Builder.java:139)
        at hudson.maven.Maven3Builder.call(Maven3Builder.java:70)
        at hudson.remoting.UserRequest.perform(UserRequest.java:153)
        at hudson.remoting.UserRequest.perform(UserRequest.java:50)
        at hudson.remoting.Request$2.run(Request.java:336)
        at hudson.remoting.InterceptingExecutorService$1.call(InterceptingExecutorService.java:68)
        at java.util.concurrent.FutureTask.run(FutureTask.java:262)
        at java.util.concurrent.ThreadPoolExecutor.runWorker(ThreadPoolExecutor.java:1145)
        at java.util.concurrent.ThreadPoolExecutor$Worker.run(ThreadPoolExecutor.java:615)
        at java.lang.Thread.run(Thread.java:745)
Caused by: java.lang.UnsupportedClassVersionError: org/apache/karaf/tooling/features/GenerateDescriptorMojo : Unsupported major.minor version 52.0
        at java.lang.ClassLoader.defineClass1(Native Method)
        at java.lang.ClassLoader.defineClass(ClassLoader.java:800)
        at java.security.SecureClassLoader.defineClass(SecureClassLoader.java:142)
        at java.net.URLClassLoader.defineClass(URLClassLoader.java:449)
        at java.net.URLClassLoader.access$100(URLClassLoader.java:71)
        at java.net.URLClassLoader$1.run(URLClassLoader.java:361)
        at java.net.URLClassLoader$1.run(URLClassLoader.java:355)
        at java.security.AccessController.doPrivileged(Native Method)
        at java.net.URLClassLoader.findClass(URLClassLoader.java:354)
        at org.codehaus.plexus.classworlds.realm.ClassRealm.loadClassFromSelf(ClassRealm.java:386)
        at org.codehaus.plexus.classworlds.strategy.SelfFirstStrategy.loadClass(SelfFirstStrategy.java:42)
        at org.codehaus.plexus.classworlds.realm.ClassRealm.loadClass(ClassRealm.java:244)
        at org.codehaus.plexus.classworlds.realm.ClassRealm.loadClass(ClassRealm.java:230)
        at hudson.maven.ExecutedMojo.getMojoClass(ExecutedMojo.java:126)
        at hudson.maven.ExecutedMojo.<init>(ExecutedMojo.java:99)
        at hudson.maven.Maven3Builder$MavenExecutionListener.recordExecutionTime(Maven3Builder.java:654)
        at hudson.maven.Maven3Builder$MavenExecutionListener.recordMojoEnded(Maven3Builder.java:618)
        at hudson.maven.Maven3Builder$MavenExecutionListener.mojoFailed(Maven3Builder.java:662)
        at org.apache.maven.lifecycle.internal.DefaultExecutionEventCatapult.fire(DefaultExecutionEventCatapult.java:90)
        at org.apache.maven.lifecycle.internal.MojoExecutor.execute(MojoExecutor.java:232)
        at org.apache.maven.lifecycle.internal.MojoExecutor.execute(MojoExecutor.java:153)
        at org.apache.maven.lifecycle.internal.MojoExecutor.execute(MojoExecutor.java:145)
        at org.apache.maven.lifecycle.internal.LifecycleModuleBuilder.buildProject(LifecycleModuleBuilder.java:84)
        at org.apache.maven.lifecycle.internal.LifecycleModuleBuilder.buildProject(LifecycleModuleBuilder.java:59)
        at org.apache.maven.lifecycle.internal.LifecycleStarter.singleThreadedBuild(LifecycleStarter.java:183)
        at org.apache.maven.lifecycle.internal.LifecycleStarter.execute(LifecycleStarter.java:161)
        at org.apache.maven.DefaultMaven.doExecute(DefaultMaven.java:320)
        at org.apache.maven.DefaultMaven.execute(DefaultMaven.java:156)
        at org.jvnet.hudson.maven3.launcher.Maven3Launcher.main(Maven3Launcher.java:117)
        ... 21 more
Sending e-mails to: [hidden email]
ERROR: Failed to parse POMs
java.io.IOException: java.lang.reflect.InvocationTargetException
        at hudson.maven.Maven3Builder.call(Maven3Builder.java:179)
        at hudson.maven.Maven3Builder.call(Maven3Builder.java:70)
        at hudson.remoting.UserRequest.perform(UserRequest.java:153)
        at hudson.remoting.UserRequest.perform(UserRequest.java:50)
        at hudson.remoting.Request$2.run(Request.java:336)
        at hudson.remoting.InterceptingExecutorService$1.call(InterceptingExecutorService.java:68)
        at java.util.concurrent.FutureTask.run(FutureTask.java:262)
        at java.util.concurrent.ThreadPoolExecutor.runWorker(ThreadPoolExecutor.java:1145)
        at java.util.concurrent.ThreadPoolExecutor$Worker.run(ThreadPoolExecutor.java:615)
        at java.lang.Thread.run(Thread.java:745)
        at ......remote call to Channel to Maven [/home/jenkins/tools/java/latest1.7/bin/java, -Xmx1280m, -XX:MaxPermSize=512m, -cp, /home/jenkins/jenkins-slave/maven3-agent.jar:/home/jenkins/tools/maven/apache-maven-3.0.4/boot/plexus-classworlds-2.4.jar, org.jvnet.hudson.maven3.agent.Maven3Main, /home/jenkins/tools/maven/apache-maven-3.0.4, /home/jenkins/jenkins-slave/slave.jar, /home/jenkins/jenkins-slave/maven3-interceptor.jar, /home/jenkins/jenkins-slave/maven3-interceptor-commons.jar, 41647](Native Method)
        at hudson.remoting.Channel.attachCallSiteStackTrace(Channel.java:1545)
        at hudson.remoting.UserResponse.retrieve(UserRequest.java:253)
        at hudson.remoting.Channel.call(Channel.java:830)
        at hudson.maven.ProcessCache$MavenProcess.call(ProcessCache.java:161)
        at hudson.maven.MavenModuleSetBuild$MavenModuleSetBuildExecution.doRun(MavenModuleSetBuild.java:873)
        at hudson.model.AbstractBuild$AbstractBuildExecution.run(AbstractBuild.java:534)
        at hudson.model.Run.execute(Run.java:1728)
        at hudson.maven.MavenModuleSetBuild.run(MavenModuleSetBuild.java:544)
        at hudson.model.ResourceController.execute(ResourceController.java:98)
        at hudson.model.Executor.run(Executor.java:405)
Caused by: java.lang.reflect.InvocationTargetException
        at sun.reflect.NativeMethodAccessorImpl.invoke0(Native Method)
        at sun.reflect.NativeMethodAccessorImpl.invoke(NativeMethodAccessorImpl.java:57)
        at sun.reflect.DelegatingMethodAccessorImpl.invoke(DelegatingMethodAccessorImpl.java:43)
        at java.lang.reflect.Method.invoke(Method.java:606)
        at hudson.maven.Maven3Builder.call(Maven3Builder.java:139)
        at hudson.maven.Maven3Builder.call(Maven3Builder.java:70)
        at hudson.remoting.UserRequest.perform(UserRequest.java:153)
        at hudson.remoting.UserRequest.perform(UserRequest.java:50)
        at hudson.remoting.Request$2.run(Request.java:336)
        at hudson.remoting.InterceptingExecutorService$1.call(InterceptingExecutorService.java:68)
        at java.util.concurrent.FutureTask.run(FutureTask.java:262)
        at java.util.concurrent.ThreadPoolExecutor.runWorker(ThreadPoolExecutor.java:1145)
        at java.util.concurrent.ThreadPoolExecutor$Worker.run(ThreadPoolExecutor.java:615)
        at java.lang.Thread.run(Thread.java:745)
Caused by: java.lang.Exception: java.lang.reflect.InvocationTargetException
        at org.jvnet.hudson.maven3.agent.Maven3Main.launch(Maven3Main.java:184)
        ... 14 more
Caused by: java.lang.reflect.InvocationTargetException
        at sun.reflect.NativeMethodAccessorImpl.invoke0(Native Method)
        at sun.reflect.NativeMethodAccessorImpl.invoke(NativeMethodAccessorImpl.java:57)
        at sun.reflect.DelegatingMethodAccessorImpl.invoke(DelegatingMethodAccessorImpl.java:43)
        at java.lang.reflect.Method.invoke(Method.java:606)
        at org.codehaus.plexus.classworlds.launcher.Launcher.launchStandard(Launcher.java:329)
        at org.codehaus.plexus.classworlds.launcher.Launcher.launch(Launcher.java:239)
        at org.jvnet.hudson.maven3.agent.Maven3Main.launch(Maven3Main.java:181)
        ... 14 more
Caused by: java.lang.UnsupportedClassVersionError: org/apache/karaf/tooling/features/GenerateDescriptorMojo : Unsupported major.minor version 52.0
        at java.lang.ClassLoader.defineClass1(Native Method)
        at java.lang.ClassLoader.defineClass(ClassLoader.java:800)
        at java.security.SecureClassLoader.defineClass(SecureClassLoader.java:142)
        at java.net.URLClassLoader.defineClass(URLClassLoader.java:449)
        at java.net.URLClassLoader.access$100(URLClassLoader.java:71)
        at java.net.URLClassLoader$1.run(URLClassLoader.java:361)
        at java.net.URLClassLoader$1.run(URLClassLoader.java:355)
        at java.security.AccessController.doPrivileged(Native Method)
        at java.net.URLClassLoader.findClass(URLClassLoader.java:354)
        at org.codehaus.plexus.classworlds.realm.ClassRealm.loadClassFromSelf(ClassRealm.java:386)
        at org.codehaus.plexus.classworlds.strategy.SelfFirstStrategy.loadClass(SelfFirstStrategy.java:42)
        at org.codehaus.plexus.classworlds.realm.ClassRealm.loadClass(ClassRealm.java:244)
        at org.codehaus.plexus.classworlds.realm.ClassRealm.loadClass(ClassRealm.java:230)
        at hudson.maven.ExecutedMojo.getMojoClass(ExecutedMojo.java:126)
        at hudson.maven.ExecutedMojo.<init>(ExecutedMojo.java:99)
        at hudson.maven.Maven3Builder$MavenExecutionListener.recordExecutionTime(Maven3Builder.java:654)
        at hudson.maven.Maven3Builder$MavenExecutionListener.recordMojoEnded(Maven3Builder.java:618)
        at hudson.maven.Maven3Builder$MavenExecutionListener.mojoFailed(Maven3Builder.java:662)
        at org.apache.maven.lifecycle.internal.DefaultExecutionEventCatapult.fire(DefaultExecutionEventCatapult.java:90)
        at org.apache.maven.lifecycle.internal.MojoExecutor.execute(MojoExecutor.java:232)
        at org.apache.maven.lifecycle.internal.MojoExecutor.execute(MojoExecutor.java:153)
        at org.apache.maven.lifecycle.internal.MojoExecutor.execute(MojoExecutor.java:145)
        at org.apache.maven.lifecycle.internal.LifecycleModuleBuilder.buildProject(LifecycleModuleBuilder.java:84)
        at org.apache.maven.lifecycle.internal.LifecycleModuleBuilder.buildProject(LifecycleModuleBuilder.java:59)
        at org.apache.maven.lifecycle.internal.LifecycleStarter.singleThreadedBuild(LifecycleStarter.java:183)
        at org.apache.maven.lifecycle.internal.LifecycleStarter.execute(LifecycleStarter.java:161)
        at org.apache.maven.DefaultMaven.doExecute(DefaultMaven.java:320)
        at org.apache.maven.DefaultMaven.execute(DefaultMaven.java:156)
        at org.jvnet.hudson.maven3.launcher.Maven3Launcher.main(Maven3Launcher.java:117)
        ... 21 more
channel stopped
Reply | Threaded
Open this post in threaded view
|  
Report Content as Inappropriate

Build failed in Jenkins: OpenJPA-trunk #1098

Apache Jenkins Server-2
See <https://builds.apache.org/job/OpenJPA-trunk/1098/display/redirect?page=changes>

Changes:

[jgrassel] OPENJPA-2705: ArrayOutOfBoundsException occurs with an @EmbeddedId (commit on wdazeys behalf)

------------------------------------------
[...truncated 1.69 MB...]
[INFO] --- maven-install-plugin:2.5.2:install (default-install) @ openjpa-tools ---
[INFO] Installing <https://builds.apache.org/job/OpenJPA-trunk/ws/trunk/openjpa-tools/pom.xml> to /home/jenkins/jenkins-slave/maven-repositories/1/org/apache/openjpa/openjpa-tools/3.0.0-SNAPSHOT/openjpa-tools-3.0.0-SNAPSHOT.pom
[INFO]                                                                        
[INFO] ------------------------------------------------------------------------
[INFO] Building OpenJPA Maven Plugin 3.0.0-SNAPSHOT
[INFO] ------------------------------------------------------------------------
[INFO]
[INFO] --- maven-clean-plugin:3.0.0:clean (default-clean) @ openjpa-maven-plugin ---
[INFO]
[INFO] --- buildnumber-maven-plugin:1.4:create (default) @ openjpa-maven-plugin ---
[INFO]
[INFO] --- maven-enforcer-plugin:1.4.1:enforce (default) @ openjpa-maven-plugin ---
[INFO]
[INFO] --- maven-plugin-plugin:3.4:helpmojo (help-goal) @ openjpa-maven-plugin ---
[INFO] Using 'UTF-8' encoding to read mojo metadata.
[INFO] Mojo extractor with id: java-javadoc found 0 mojo descriptors.
[INFO] Mojo extractor with id: java-annotations found 0 mojo descriptors.
[INFO]
[INFO] --- maven-checkstyle-plugin:2.9:checkstyle (default) @ openjpa-maven-plugin ---
[INFO] Starting audit...
Audit done.

[WARNING] Unable to locate Source XRef to link to - DISABLED
[INFO]
[INFO] --- maven-plugin-plugin:3.4:descriptor (default-descriptor) @ openjpa-maven-plugin ---
[INFO] Using 'UTF-8' encoding to read mojo metadata.
[INFO] Mojo extractor with id: java-javadoc found 0 mojo descriptors.
[INFO] Mojo extractor with id: java-annotations found 0 mojo descriptors.
[INFO]
[INFO] --- maven-remote-resources-plugin:1.5:process (process-resource-bundles) @ openjpa-maven-plugin ---
[INFO]
[INFO] --- maven-resources-plugin:2.7:resources (default-resources) @ openjpa-maven-plugin ---
[INFO] Using 'UTF-8' encoding to copy filtered resources.
[INFO] skip non existing resourceDirectory <https://builds.apache.org/job/OpenJPA-trunk/ws/trunk/openjpa-tools/openjpa-maven-plugin/src/main/resources>
[INFO] Copying 3 resources
[INFO]
[INFO] --- maven-compiler-plugin:3.5.1:compile (default-compile) @ openjpa-maven-plugin ---
[INFO] Changes detected - recompiling the module!
[INFO] Compiling 8 source files to <https://builds.apache.org/job/OpenJPA-trunk/ws/trunk/openjpa-tools/openjpa-maven-plugin/target/classes>
[INFO]
[INFO] --- maven-plugin-plugin:3.4:descriptor (mojo-descriptor) @ openjpa-maven-plugin ---
[INFO] Using 'UTF-8' encoding to read mojo metadata.
[INFO] Mojo extractor with id: java-javadoc found 0 mojo descriptors.
[INFO] Mojo extractor with id: java-annotations found 5 mojo descriptors.
[INFO]
[INFO] --- maven-compiler-plugin:3.5.1:testCompile (test-source-compile) @ openjpa-maven-plugin ---
[INFO] Changes detected - recompiling the module!
[INFO] Compiling 3 source files to <https://builds.apache.org/job/OpenJPA-trunk/ws/trunk/openjpa-tools/openjpa-maven-plugin/target/test-classes>
[INFO]
[INFO] --- maven-resources-plugin:2.7:testResources (default-testResources) @ openjpa-maven-plugin ---
[INFO] Using 'UTF-8' encoding to copy filtered resources.
[INFO] Copying 4 resources
[INFO] Copying 3 resources
[INFO]
[INFO] --- maven-compiler-plugin:3.5.1:testCompile (default-testCompile) @ openjpa-maven-plugin ---
[INFO] Changes detected - recompiling the module!
[INFO] Compiling 3 source files to <https://builds.apache.org/job/OpenJPA-trunk/ws/trunk/openjpa-tools/openjpa-maven-plugin/target/test-classes>
[INFO]
[INFO] --- maven-surefire-plugin:2.19.1:test (default-test) @ openjpa-maven-plugin ---

-------------------------------------------------------
 T E S T S
-------------------------------------------------------
Running org.apache.openjpa.tools.maven.OpenJpaEnhancerMojoTest
Tests run: 1, Failures: 0, Errors: 0, Skipped: 0, Time elapsed: 1.129 sec - in org.apache.openjpa.tools.maven.OpenJpaEnhancerMojoTest

Results :

Tests run: 1, Failures: 0, Errors: 0, Skipped: 0

[JENKINS] Recording test results
[INFO]
[INFO] --- maven-jar-plugin:3.0.2:jar (default-jar) @ openjpa-maven-plugin ---
[INFO] Building jar: <https://builds.apache.org/job/OpenJPA-trunk/ws/trunk/openjpa-tools/openjpa-maven-plugin/target/openjpa-maven-plugin-3.0.0-SNAPSHOT.jar>
[INFO]
[INFO] --- maven-plugin-plugin:3.4:addPluginArtifactMetadata (default-addPluginArtifactMetadata) @ openjpa-maven-plugin ---
[INFO]
[INFO] --- maven-site-plugin:3.5.1:attach-descriptor (attach-descriptor) @ openjpa-maven-plugin ---
[INFO]
[INFO] --- maven-jar-plugin:3.0.2:test-jar (attach-tests) @ openjpa-maven-plugin ---
[INFO] Building jar: <https://builds.apache.org/job/OpenJPA-trunk/ws/trunk/openjpa-tools/openjpa-maven-plugin/target/openjpa-maven-plugin-3.0.0-SNAPSHOT-tests.jar>
[INFO]
[INFO] --- maven-invoker-plugin:2.0.0:install (integration-test) @ openjpa-maven-plugin ---
[INFO] Installing <https://builds.apache.org/job/OpenJPA-trunk/ws/trunk/pom.xml> to <https://builds.apache.org/job/OpenJPA-trunk/ws/trunk/openjpa-tools/openjpa-maven-plugin/target/local-repo/org/apache/openjpa/openjpa-parent/3.0.0-SNAPSHOT/openjpa-parent-3.0.0-SNAPSHOT.pom>
[INFO] Installing <https://builds.apache.org/job/OpenJPA-trunk/ws/trunk/target/openjpa-parent-3.0.0-SNAPSHOT-site.xml> to <https://builds.apache.org/job/OpenJPA-trunk/ws/trunk/openjpa-tools/openjpa-maven-plugin/target/local-repo/org/apache/openjpa/openjpa-parent/3.0.0-SNAPSHOT/openjpa-parent-3.0.0-SNAPSHOT-site.xml>
[INFO] Installing <https://builds.apache.org/job/OpenJPA-trunk/ws/trunk/openjpa-lib/pom.xml> to <https://builds.apache.org/job/OpenJPA-trunk/ws/trunk/openjpa-tools/openjpa-maven-plugin/target/local-repo/org/apache/openjpa/openjpa-lib/3.0.0-SNAPSHOT/openjpa-lib-3.0.0-SNAPSHOT.pom>
[INFO] Installing <https://builds.apache.org/job/OpenJPA-trunk/ws/trunk/openjpa-lib/target/openjpa-lib-3.0.0-SNAPSHOT.jar> to <https://builds.apache.org/job/OpenJPA-trunk/ws/trunk/openjpa-tools/openjpa-maven-plugin/target/local-repo/org/apache/openjpa/openjpa-lib/3.0.0-SNAPSHOT/openjpa-lib-3.0.0-SNAPSHOT.jar>
[INFO] Installing <https://builds.apache.org/job/OpenJPA-trunk/ws/trunk/openjpa-lib/pom.xml> to <https://builds.apache.org/job/OpenJPA-trunk/ws/trunk/openjpa-tools/openjpa-maven-plugin/target/local-repo/org/apache/openjpa/openjpa-lib/3.0.0-SNAPSHOT/openjpa-lib-3.0.0-SNAPSHOT.pom>
[INFO] Installing <https://builds.apache.org/job/OpenJPA-trunk/ws/trunk/openjpa-lib/target/openjpa-lib-3.0.0-SNAPSHOT-tests.jar> to <https://builds.apache.org/job/OpenJPA-trunk/ws/trunk/openjpa-tools/openjpa-maven-plugin/target/local-repo/org/apache/openjpa/openjpa-lib/3.0.0-SNAPSHOT/openjpa-lib-3.0.0-SNAPSHOT-tests.jar>
[INFO] Installing <https://builds.apache.org/job/OpenJPA-trunk/ws/trunk/openjpa-kernel/pom.xml> to <https://builds.apache.org/job/OpenJPA-trunk/ws/trunk/openjpa-tools/openjpa-maven-plugin/target/local-repo/org/apache/openjpa/openjpa-kernel/3.0.0-SNAPSHOT/openjpa-kernel-3.0.0-SNAPSHOT.pom>
[INFO] Installing <https://builds.apache.org/job/OpenJPA-trunk/ws/trunk/openjpa-kernel/target/openjpa-kernel-3.0.0-SNAPSHOT.jar> to <https://builds.apache.org/job/OpenJPA-trunk/ws/trunk/openjpa-tools/openjpa-maven-plugin/target/local-repo/org/apache/openjpa/openjpa-kernel/3.0.0-SNAPSHOT/openjpa-kernel-3.0.0-SNAPSHOT.jar>
[INFO] Installing <https://builds.apache.org/job/OpenJPA-trunk/ws/trunk/openjpa-kernel/pom.xml> to <https://builds.apache.org/job/OpenJPA-trunk/ws/trunk/openjpa-tools/openjpa-maven-plugin/target/local-repo/org/apache/openjpa/openjpa-kernel/3.0.0-SNAPSHOT/openjpa-kernel-3.0.0-SNAPSHOT.pom>
[INFO] Installing <https://builds.apache.org/job/OpenJPA-trunk/ws/trunk/openjpa-kernel/target/openjpa-kernel-3.0.0-SNAPSHOT-tests.jar> to <https://builds.apache.org/job/OpenJPA-trunk/ws/trunk/openjpa-tools/openjpa-maven-plugin/target/local-repo/org/apache/openjpa/openjpa-kernel/3.0.0-SNAPSHOT/openjpa-kernel-3.0.0-SNAPSHOT-tests.jar>
[INFO] Installing <https://builds.apache.org/job/OpenJPA-trunk/ws/trunk/openjpa-jdbc/pom.xml> to <https://builds.apache.org/job/OpenJPA-trunk/ws/trunk/openjpa-tools/openjpa-maven-plugin/target/local-repo/org/apache/openjpa/openjpa-jdbc/3.0.0-SNAPSHOT/openjpa-jdbc-3.0.0-SNAPSHOT.pom>
[INFO] Installing <https://builds.apache.org/job/OpenJPA-trunk/ws/trunk/openjpa-jdbc/target/openjpa-jdbc-3.0.0-SNAPSHOT.jar> to <https://builds.apache.org/job/OpenJPA-trunk/ws/trunk/openjpa-tools/openjpa-maven-plugin/target/local-repo/org/apache/openjpa/openjpa-jdbc/3.0.0-SNAPSHOT/openjpa-jdbc-3.0.0-SNAPSHOT.jar>
[INFO] Installing <https://builds.apache.org/job/OpenJPA-trunk/ws/trunk/openjpa-jdbc/pom.xml> to <https://builds.apache.org/job/OpenJPA-trunk/ws/trunk/openjpa-tools/openjpa-maven-plugin/target/local-repo/org/apache/openjpa/openjpa-jdbc/3.0.0-SNAPSHOT/openjpa-jdbc-3.0.0-SNAPSHOT.pom>
[INFO] Installing <https://builds.apache.org/job/OpenJPA-trunk/ws/trunk/openjpa-jdbc/target/openjpa-jdbc-3.0.0-SNAPSHOT-tests.jar> to <https://builds.apache.org/job/OpenJPA-trunk/ws/trunk/openjpa-tools/openjpa-maven-plugin/target/local-repo/org/apache/openjpa/openjpa-jdbc/3.0.0-SNAPSHOT/openjpa-jdbc-3.0.0-SNAPSHOT-tests.jar>
[INFO] Installing <https://builds.apache.org/job/OpenJPA-trunk/ws/trunk/openjpa-persistence/pom.xml> to <https://builds.apache.org/job/OpenJPA-trunk/ws/trunk/openjpa-tools/openjpa-maven-plugin/target/local-repo/org/apache/openjpa/openjpa-persistence/3.0.0-SNAPSHOT/openjpa-persistence-3.0.0-SNAPSHOT.pom>
[INFO] Installing <https://builds.apache.org/job/OpenJPA-trunk/ws/trunk/openjpa-persistence/target/openjpa-persistence-3.0.0-SNAPSHOT.jar> to <https://builds.apache.org/job/OpenJPA-trunk/ws/trunk/openjpa-tools/openjpa-maven-plugin/target/local-repo/org/apache/openjpa/openjpa-persistence/3.0.0-SNAPSHOT/openjpa-persistence-3.0.0-SNAPSHOT.jar>
[INFO] Installing <https://builds.apache.org/job/OpenJPA-trunk/ws/trunk/openjpa-persistence/pom.xml> to <https://builds.apache.org/job/OpenJPA-trunk/ws/trunk/openjpa-tools/openjpa-maven-plugin/target/local-repo/org/apache/openjpa/openjpa-persistence/3.0.0-SNAPSHOT/openjpa-persistence-3.0.0-SNAPSHOT.pom>
[INFO] Installing <https://builds.apache.org/job/OpenJPA-trunk/ws/trunk/openjpa-persistence/target/openjpa-persistence-3.0.0-SNAPSHOT-tests.jar> to <https://builds.apache.org/job/OpenJPA-trunk/ws/trunk/openjpa-tools/openjpa-maven-plugin/target/local-repo/org/apache/openjpa/openjpa-persistence/3.0.0-SNAPSHOT/openjpa-persistence-3.0.0-SNAPSHOT-tests.jar>
[INFO] Installing <https://builds.apache.org/job/OpenJPA-trunk/ws/trunk/openjpa-persistence-jdbc/pom.xml> to <https://builds.apache.org/job/OpenJPA-trunk/ws/trunk/openjpa-tools/openjpa-maven-plugin/target/local-repo/org/apache/openjpa/openjpa-persistence-jdbc/3.0.0-SNAPSHOT/openjpa-persistence-jdbc-3.0.0-SNAPSHOT.pom>
[INFO] Installing <https://builds.apache.org/job/OpenJPA-trunk/ws/trunk/openjpa-persistence-jdbc/target/openjpa-persistence-jdbc-3.0.0-SNAPSHOT.jar> to <https://builds.apache.org/job/OpenJPA-trunk/ws/trunk/openjpa-tools/openjpa-maven-plugin/target/local-repo/org/apache/openjpa/openjpa-persistence-jdbc/3.0.0-SNAPSHOT/openjpa-persistence-jdbc-3.0.0-SNAPSHOT.jar>
[INFO] Installing <https://builds.apache.org/job/OpenJPA-trunk/ws/trunk/openjpa-persistence-jdbc/pom.xml> to <https://builds.apache.org/job/OpenJPA-trunk/ws/trunk/openjpa-tools/openjpa-maven-plugin/target/local-repo/org/apache/openjpa/openjpa-persistence-jdbc/3.0.0-SNAPSHOT/openjpa-persistence-jdbc-3.0.0-SNAPSHOT.pom>
[INFO] Installing <https://builds.apache.org/job/OpenJPA-trunk/ws/trunk/openjpa-persistence-jdbc/target/openjpa-persistence-jdbc-3.0.0-SNAPSHOT-tests.jar> to <https://builds.apache.org/job/OpenJPA-trunk/ws/trunk/openjpa-tools/openjpa-maven-plugin/target/local-repo/org/apache/openjpa/openjpa-persistence-jdbc/3.0.0-SNAPSHOT/openjpa-persistence-jdbc-3.0.0-SNAPSHOT-tests.jar>
[INFO] Installing <https://builds.apache.org/job/OpenJPA-trunk/ws/trunk/openjpa-persistence-locking/pom.xml> to <https://builds.apache.org/job/OpenJPA-trunk/ws/trunk/openjpa-tools/openjpa-maven-plugin/target/local-repo/org/apache/openjpa/openjpa-persistence-locking/3.0.0-SNAPSHOT/openjpa-persistence-locking-3.0.0-SNAPSHOT.pom>
[INFO] Installing <https://builds.apache.org/job/OpenJPA-trunk/ws/trunk/openjpa-persistence-locking/target/openjpa-persistence-locking-3.0.0-SNAPSHOT.jar> to <https://builds.apache.org/job/OpenJPA-trunk/ws/trunk/openjpa-tools/openjpa-maven-plugin/target/local-repo/org/apache/openjpa/openjpa-persistence-locking/3.0.0-SNAPSHOT/openjpa-persistence-locking-3.0.0-SNAPSHOT.jar>
[INFO] Installing <https://builds.apache.org/job/OpenJPA-trunk/ws/trunk/openjpa-persistence-locking/pom.xml> to <https://builds.apache.org/job/OpenJPA-trunk/ws/trunk/openjpa-tools/openjpa-maven-plugin/target/local-repo/org/apache/openjpa/openjpa-persistence-locking/3.0.0-SNAPSHOT/openjpa-persistence-locking-3.0.0-SNAPSHOT.pom>
[INFO] Installing <https://builds.apache.org/job/OpenJPA-trunk/ws/trunk/openjpa-persistence-locking/target/openjpa-persistence-locking-3.0.0-SNAPSHOT-tests.jar> to <https://builds.apache.org/job/OpenJPA-trunk/ws/trunk/openjpa-tools/openjpa-maven-plugin/target/local-repo/org/apache/openjpa/openjpa-persistence-locking/3.0.0-SNAPSHOT/openjpa-persistence-locking-3.0.0-SNAPSHOT-tests.jar>
[INFO] Installing <https://builds.apache.org/job/OpenJPA-trunk/ws/trunk/openjpa-tools/pom.xml> to <https://builds.apache.org/job/OpenJPA-trunk/ws/trunk/openjpa-tools/openjpa-maven-plugin/target/local-repo/org/apache/openjpa/openjpa-tools/3.0.0-SNAPSHOT/openjpa-tools-3.0.0-SNAPSHOT.pom>
[INFO] Installing <https://builds.apache.org/job/OpenJPA-trunk/ws/trunk/openjpa-tools/openjpa-maven-plugin/pom.xml> to <https://builds.apache.org/job/OpenJPA-trunk/ws/trunk/openjpa-tools/openjpa-maven-plugin/target/local-repo/org/apache/openjpa/openjpa-maven-plugin/3.0.0-SNAPSHOT/openjpa-maven-plugin-3.0.0-SNAPSHOT.pom>
[INFO] Installing <https://builds.apache.org/job/OpenJPA-trunk/ws/trunk/openjpa-tools/openjpa-maven-plugin/target/openjpa-maven-plugin-3.0.0-SNAPSHOT.jar> to <https://builds.apache.org/job/OpenJPA-trunk/ws/trunk/openjpa-tools/openjpa-maven-plugin/target/local-repo/org/apache/openjpa/openjpa-maven-plugin/3.0.0-SNAPSHOT/openjpa-maven-plugin-3.0.0-SNAPSHOT.jar>
[INFO] Installing <https://builds.apache.org/job/OpenJPA-trunk/ws/trunk/openjpa-tools/openjpa-maven-plugin/target/openjpa-maven-plugin-3.0.0-SNAPSHOT-tests.jar> to <https://builds.apache.org/job/OpenJPA-trunk/ws/trunk/openjpa-tools/openjpa-maven-plugin/target/local-repo/org/apache/openjpa/openjpa-maven-plugin/3.0.0-SNAPSHOT/openjpa-maven-plugin-3.0.0-SNAPSHOT-tests.jar>
[INFO]
[INFO] --- maven-invoker-plugin:2.0.0:run (integration-test) @ openjpa-maven-plugin ---
[INFO] Building: sqlActionDropSchema/pom.xml
[INFO] ..SUCCESS (16.9 s)
[INFO] Building: testDependencies/pom.xml
[INFO] ..SUCCESS (11.8 s)
[INFO] Building: default_settings/pom.xml
[INFO] ..SUCCESS (10.5 s)
[INFO] Building: nonDefaultPersistenceXml/pom.xml
[INFO] ..SUCCESS (10.0 s)
[INFO] Building: enhanceIncludesExcludes/pom.xml
[INFO] run script verify.groovy
[INFO] ..SUCCESS (8.5 s)
[INFO] Building: dependingArtifact/pom.xml
[INFO] ..SUCCESS (9.3 s)
[INFO] -------------------------------------------------
[INFO] Build Summary:
[INFO]   Passed: 6, Failed: 0, Errors: 0, Skipped: 0
[INFO] -------------------------------------------------
MavenInvokerArchiver
found reports:[<https://builds.apache.org/job/OpenJPA-trunk/ws/trunk/openjpa-tools/openjpa-maven-plugin/target/invoker-reports/BUILD-enhanceIncludesExcludes.xml,> <https://builds.apache.org/job/OpenJPA-trunk/ws/trunk/openjpa-tools/openjpa-maven-plugin/target/invoker-reports/BUILD-nonDefaultPersistenceXml.xml,> <https://builds.apache.org/job/OpenJPA-trunk/ws/trunk/openjpa-tools/openjpa-maven-plugin/target/invoker-reports/BUILD-testDependencies.xml,> <https://builds.apache.org/job/OpenJPA-trunk/ws/trunk/openjpa-tools/openjpa-maven-plugin/target/invoker-reports/BUILD-default_settings.xml,> <https://builds.apache.org/job/OpenJPA-trunk/ws/trunk/openjpa-tools/openjpa-maven-plugin/target/invoker-reports/BUILD-sqlActionDropSchema.xml,> <https://builds.apache.org/job/OpenJPA-trunk/ws/trunk/openjpa-tools/openjpa-maven-plugin/target/invoker-reports/BUILD-dependingArtifact.xml]>
java.lang.reflect.InvocationTargetException
        at sun.reflect.NativeMethodAccessorImpl.invoke0(Native Method)
        at sun.reflect.NativeMethodAccessorImpl.invoke(NativeMethodAccessorImpl.java:62)
        at sun.reflect.DelegatingMethodAccessorImpl.invoke(DelegatingMethodAccessorImpl.java:43)
        at java.lang.reflect.Method.invoke(Method.java:498)
        at org.codehaus.plexus.classworlds.launcher.Launcher.launchStandard(Launcher.java:329)
        at org.codehaus.plexus.classworlds.launcher.Launcher.launch(Launcher.java:239)
        at org.jvnet.hudson.maven3.agent.Maven3Main.launch(Maven3Main.java:181)
        at sun.reflect.NativeMethodAccessorImpl.invoke0(Native Method)
        at sun.reflect.NativeMethodAccessorImpl.invoke(NativeMethodAccessorImpl.java:62)
        at sun.reflect.DelegatingMethodAccessorImpl.invoke(DelegatingMethodAccessorImpl.java:43)
        at java.lang.reflect.Method.invoke(Method.java:498)
        at hudson.maven.Maven3Builder.call(Maven3Builder.java:139)
        at hudson.maven.Maven3Builder.call(Maven3Builder.java:70)
        at hudson.remoting.UserRequest.perform(UserRequest.java:153)
        at hudson.remoting.UserRequest.perform(UserRequest.java:50)
        at hudson.remoting.Request$2.run(Request.java:336)
        at hudson.remoting.InterceptingExecutorService$1.call(InterceptingExecutorService.java:68)
        at java.util.concurrent.FutureTask.run(FutureTask.java:266)
        at java.util.concurrent.ThreadPoolExecutor.runWorker(ThreadPoolExecutor.java:1142)
        at java.util.concurrent.ThreadPoolExecutor$Worker.run(ThreadPoolExecutor.java:617)
        at java.lang.Thread.run(Thread.java:748)
Caused by: java.lang.NoSuchMethodError: org.codehaus.plexus.util.xml.pull.MXParser.<init>(Lorg/codehaus/plexus/util/xml/pull/EntityReplacementMap;)V
        at org.apache.maven.plugin.invoker.model.io.xpp3.BuildJobXpp3Reader.read(BuildJobXpp3Reader.java:510)
        at org.apache.maven.plugin.invoker.model.io.xpp3.BuildJobXpp3Reader.read(BuildJobXpp3Reader.java:529)
        at org.apache.maven.plugin.invoker.model.io.xpp3.BuildJobXpp3Reader.read(BuildJobXpp3Reader.java:558)
        at org.jenkinsci.plugins.maveninvoker.MavenInvokerArchiver.postExecute(MavenInvokerArchiver.java:113)
        at hudson.maven.Maven3Builder$MavenExecutionListener.recordMojoEnded(Maven3Builder.java:629)
        at hudson.maven.Maven3Builder$MavenExecutionListener.mojoSucceeded(Maven3Builder.java:610)
        at org.apache.maven.lifecycle.internal.DefaultExecutionEventCatapult.fire(DefaultExecutionEventCatapult.java:87)
        at org.apache.maven.lifecycle.internal.DefaultExecutionEventCatapult.fire(DefaultExecutionEventCatapult.java:42)
        at org.apache.maven.lifecycle.internal.MojoExecutor.execute(MojoExecutor.java:228)
        at org.apache.maven.lifecycle.internal.MojoExecutor.execute(MojoExecutor.java:153)
        at org.apache.maven.lifecycle.internal.MojoExecutor.execute(MojoExecutor.java:145)
        at org.apache.maven.lifecycle.internal.LifecycleModuleBuilder.buildProject(LifecycleModuleBuilder.java:84)
        at org.apache.maven.lifecycle.internal.LifecycleModuleBuilder.buildProject(LifecycleModuleBuilder.java:59)
        at org.apache.maven.lifecycle.internal.LifecycleStarter.singleThreadedBuild(LifecycleStarter.java:183)
        at org.apache.maven.lifecycle.internal.LifecycleStarter.execute(LifecycleStarter.java:161)
        at org.apache.maven.DefaultMaven.doExecute(DefaultMaven.java:320)
        at org.apache.maven.DefaultMaven.execute(DefaultMaven.java:156)
        at org.jvnet.hudson.maven3.launcher.Maven3Launcher.main(Maven3Launcher.java:117)
        ... 21 more
Sending e-mails to: [hidden email]
Sending e-mails to: [hidden email]
ERROR: Failed to parse POMs
java.io.IOException: java.lang.reflect.InvocationTargetException
        at hudson.maven.Maven3Builder.call(Maven3Builder.java:179)
        at hudson.maven.Maven3Builder.call(Maven3Builder.java:70)
        at hudson.remoting.UserRequest.perform(UserRequest.java:153)
        at hudson.remoting.UserRequest.perform(UserRequest.java:50)
        at hudson.remoting.Request$2.run(Request.java:336)
        at hudson.remoting.InterceptingExecutorService$1.call(InterceptingExecutorService.java:68)
        at java.util.concurrent.FutureTask.run(FutureTask.java:266)
        at java.util.concurrent.ThreadPoolExecutor.runWorker(ThreadPoolExecutor.java:1142)
        at java.util.concurrent.ThreadPoolExecutor$Worker.run(ThreadPoolExecutor.java:617)
        at java.lang.Thread.run(Thread.java:748)
        at ......remote call to Channel to Maven [/usr/local/asfpackages/java/jdk1.8.0_131/jre/bin/java, -Xmx1280m, -XX:MaxPermSize=512m, -cp, /home/jenkins/jenkins-slave/maven3-agent.jar:/home/jenkins/tools/maven/apache-maven-3.0.4/boot/plexus-classworlds-2.4.jar, org.jvnet.hudson.maven3.agent.Maven3Main, /home/jenkins/tools/maven/apache-maven-3.0.4, /home/jenkins/jenkins-slave/slave.jar, /home/jenkins/jenkins-slave/maven3-interceptor.jar, /home/jenkins/jenkins-slave/maven3-interceptor-commons.jar, 46872](Native Method)
        at hudson.remoting.Channel.attachCallSiteStackTrace(Channel.java:1545)
        at hudson.remoting.UserResponse.retrieve(UserRequest.java:253)
        at hudson.remoting.Channel.call(Channel.java:830)
        at hudson.maven.ProcessCache$MavenProcess.call(ProcessCache.java:161)
        at hudson.maven.MavenModuleSetBuild$MavenModuleSetBuildExecution.doRun(MavenModuleSetBuild.java:878)
        at hudson.model.AbstractBuild$AbstractBuildExecution.run(AbstractBuild.java:490)
        at hudson.model.Run.execute(Run.java:1735)
        at hudson.maven.MavenModuleSetBuild.run(MavenModuleSetBuild.java:542)
        at hudson.model.ResourceController.execute(ResourceController.java:97)
        at hudson.model.Executor.run(Executor.java:405)
Caused by: java.lang.reflect.InvocationTargetException
        at sun.reflect.NativeMethodAccessorImpl.invoke0(Native Method)
        at sun.reflect.NativeMethodAccessorImpl.invoke(NativeMethodAccessorImpl.java:62)
        at sun.reflect.DelegatingMethodAccessorImpl.invoke(DelegatingMethodAccessorImpl.java:43)
        at java.lang.reflect.Method.invoke(Method.java:498)
        at hudson.maven.Maven3Builder.call(Maven3Builder.java:139)
        at hudson.maven.Maven3Builder.call(Maven3Builder.java:70)
        at hudson.remoting.UserRequest.perform(UserRequest.java:153)
        at hudson.remoting.UserRequest.perform(UserRequest.java:50)
        at hudson.remoting.Request$2.run(Request.java:336)
        at hudson.remoting.InterceptingExecutorService$1.call(InterceptingExecutorService.java:68)
        at java.util.concurrent.FutureTask.run(FutureTask.java:266)
        at java.util.concurrent.ThreadPoolExecutor.runWorker(ThreadPoolExecutor.java:1142)
        at java.util.concurrent.ThreadPoolExecutor$Worker.run(ThreadPoolExecutor.java:617)
        at java.lang.Thread.run(Thread.java:748)
Caused by: java.lang.Exception: java.lang.reflect.InvocationTargetException
        at org.jvnet.hudson.maven3.agent.Maven3Main.launch(Maven3Main.java:184)
        ... 14 more
Caused by: java.lang.reflect.InvocationTargetException
        at sun.reflect.NativeMethodAccessorImpl.invoke0(Native Method)
        at sun.reflect.NativeMethodAccessorImpl.invoke(NativeMethodAccessorImpl.java:62)
        at sun.reflect.DelegatingMethodAccessorImpl.invoke(DelegatingMethodAccessorImpl.java:43)
        at java.lang.reflect.Method.invoke(Method.java:498)
        at org.codehaus.plexus.classworlds.launcher.Launcher.launchStandard(Launcher.java:329)
        at org.codehaus.plexus.classworlds.launcher.Launcher.launch(Launcher.java:239)
        at org.jvnet.hudson.maven3.agent.Maven3Main.launch(Maven3Main.java:181)
        ... 14 more
Caused by: java.lang.NoSuchMethodError: org.codehaus.plexus.util.xml.pull.MXParser.<init>(Lorg/codehaus/plexus/util/xml/pull/EntityReplacementMap;)V
        at org.apache.maven.plugin.invoker.model.io.xpp3.BuildJobXpp3Reader.read(BuildJobXpp3Reader.java:510)
        at org.apache.maven.plugin.invoker.model.io.xpp3.BuildJobXpp3Reader.read(BuildJobXpp3Reader.java:529)
        at org.apache.maven.plugin.invoker.model.io.xpp3.BuildJobXpp3Reader.read(BuildJobXpp3Reader.java:558)
        at org.jenkinsci.plugins.maveninvoker.MavenInvokerArchiver.postExecute(MavenInvokerArchiver.java:113)
        at hudson.maven.Maven3Builder$MavenExecutionListener.recordMojoEnded(Maven3Builder.java:629)
        at hudson.maven.Maven3Builder$MavenExecutionListener.mojoSucceeded(Maven3Builder.java:610)
        at org.apache.maven.lifecycle.internal.DefaultExecutionEventCatapult.fire(DefaultExecutionEventCatapult.java:87)
        at org.apache.maven.lifecycle.internal.DefaultExecutionEventCatapult.fire(DefaultExecutionEventCatapult.java:42)
        at org.apache.maven.lifecycle.internal.MojoExecutor.execute(MojoExecutor.java:228)
        at org.apache.maven.lifecycle.internal.MojoExecutor.execute(MojoExecutor.java:153)
        at org.apache.maven.lifecycle.internal.MojoExecutor.execute(MojoExecutor.java:145)
        at org.apache.maven.lifecycle.internal.LifecycleModuleBuilder.buildProject(LifecycleModuleBuilder.java:84)
        at org.apache.maven.lifecycle.internal.LifecycleModuleBuilder.buildProject(LifecycleModuleBuilder.java:59)
        at org.apache.maven.lifecycle.internal.LifecycleStarter.singleThreadedBuild(LifecycleStarter.java:183)
        at org.apache.maven.lifecycle.internal.LifecycleStarter.execute(LifecycleStarter.java:161)
        at org.apache.maven.DefaultMaven.doExecute(DefaultMaven.java:320)
        at org.apache.maven.DefaultMaven.execute(DefaultMaven.java:156)
        at org.jvnet.hudson.maven3.launcher.Maven3Launcher.main(Maven3Launcher.java:117)
        ... 21 more
channel stopped
Reply | Threaded
Open this post in threaded view
|  
Report Content as Inappropriate

Build failed in Jenkins: OpenJPA-trunk #1099

Apache Jenkins Server-2
See <https://builds.apache.org/job/OpenJPA-trunk/1099/display/redirect>

------------------------------------------
[...truncated 15.57 KB...]
        at java.net.Inet6AddressImpl.lookupAllHostAddr(Native Method)
        at java.net.InetAddress$2.lookupAllHostAddr(InetAddress.java:928)
        at java.net.InetAddress.getAddressesFromNameService(InetAddress.java:1323)
        at java.net.InetAddress.getAllByName0(InetAddress.java:1276)
        at java.net.InetAddress.getAllByName(InetAddress.java:1192)
        at java.net.InetAddress.getAllByName(InetAddress.java:1126)
        at java.net.InetAddress.getByName(InetAddress.java:1076)
        at org.tmatesoft.svn.core.internal.util.SVNSocketFactory.createAddres(SVNSocketFactory.java:205)
        at org.tmatesoft.svn.core.internal.util.SVNSocketFactory._createSSLSocket(SVNSocketFactory.java:105)
        at org.tmatesoft.svn.core.internal.util.SVNSocketFactory.createSSLSocket(SVNSocketFactory.java:92)
        at org.tmatesoft.svn.core.internal.io.dav.http.HTTPConnection.connect(HTTPConnection.java:275)
        at org.tmatesoft.svn.core.internal.io.dav.http.HTTPConnection.request(HTTPConnection.java:454)
        ... 34 more
java.net.UnknownHostException: svn.apache.org: Temporary failure in name resolution
        at java.net.Inet6AddressImpl.lookupAllHostAddr(Native Method)
        at java.net.InetAddress$2.lookupAllHostAddr(InetAddress.java:928)
        at java.net.InetAddress.getAddressesFromNameService(InetAddress.java:1323)
        at java.net.InetAddress.getAllByName0(InetAddress.java:1276)
        at java.net.InetAddress.getAllByName(InetAddress.java:1192)
        at java.net.InetAddress.getAllByName(InetAddress.java:1126)
        at java.net.InetAddress.getByName(InetAddress.java:1076)
        at org.tmatesoft.svn.core.internal.util.SVNSocketFactory.createAddres(SVNSocketFactory.java:205)
        at org.tmatesoft.svn.core.internal.util.SVNSocketFactory._createSSLSocket(SVNSocketFactory.java:105)
        at org.tmatesoft.svn.core.internal.util.SVNSocketFactory.createSSLSocket(SVNSocketFactory.java:92)
        at org.tmatesoft.svn.core.internal.io.dav.http.HTTPConnection.connect(HTTPConnection.java:275)
        at org.tmatesoft.svn.core.internal.io.dav.http.HTTPConnection.request(HTTPConnection.java:454)
Caused: org.tmatesoft.svn.core.SVNException: svn: E175002: unknown host
svn: E175002: OPTIONS request failed on '/repos/asf/openjpa/trunk'
        at org.tmatesoft.svn.core.internal.wc.SVNErrorManager.error(SVNErrorManager.java:112)
        at org.tmatesoft.svn.core.internal.wc.SVNErrorManager.error(SVNErrorManager.java:96)
        at org.tmatesoft.svn.core.internal.io.dav.http.HTTPConnection.request(HTTPConnection.java:803)
        at org.tmatesoft.svn.core.internal.io.dav.http.HTTPConnection.request(HTTPConnection.java:391)
        at org.tmatesoft.svn.core.internal.io.dav.http.HTTPConnection.request(HTTPConnection.java:379)
        at org.tmatesoft.svn.core.internal.io.dav.DAVConnection.performHttpRequest(DAVConnection.java:862)
        at org.tmatesoft.svn.core.internal.io.dav.DAVConnection.exchangeCapabilities(DAVConnection.java:698)
        at org.tmatesoft.svn.core.internal.io.dav.DAVConnection.open(DAVConnection.java:118)
        at org.tmatesoft.svn.core.internal.io.dav.DAVRepository.openConnection(DAVRepository.java:1049)
        at org.tmatesoft.svn.core.internal.io.dav.DAVRepository.getLatestRevision(DAVRepository.java:189)
        at org.tmatesoft.svn.core.internal.wc2.ng.SvnNgRepositoryAccess.getRevisionNumber(SvnNgRepositoryAccess.java:119)
        at org.tmatesoft.svn.core.internal.wc2.SvnRepositoryAccess.getLocations(SvnRepositoryAccess.java:195)
        at org.tmatesoft.svn.core.internal.wc2.ng.SvnNgRepositoryAccess.createRepositoryFor(SvnNgRepositoryAccess.java:46)
        at org.tmatesoft.svn.core.internal.wc2.ng.SvnNgAbstractUpdate.checkout(SvnNgAbstractUpdate.java:815)
        at org.tmatesoft.svn.core.internal.wc2.ng.SvnNgCheckout.run(SvnNgCheckout.java:26)
        at org.tmatesoft.svn.core.internal.wc2.ng.SvnNgCheckout.run(SvnNgCheckout.java:11)
        at org.tmatesoft.svn.core.internal.wc2.ng.SvnNgOperationRunner.run(SvnNgOperationRunner.java:20)
        at org.tmatesoft.svn.core.internal.wc2.SvnOperationRunner.run(SvnOperationRunner.java:21)
        at org.tmatesoft.svn.core.wc2.SvnOperationFactory.run(SvnOperationFactory.java:1235)
        at org.tmatesoft.svn.core.wc2.SvnOperation.run(SvnOperation.java:294)
        at hudson.scm.subversion.CheckoutUpdater$1.perform(CheckoutUpdater.java:119)
        at hudson.scm.subversion.WorkspaceUpdater$UpdateTask.delegateTo(WorkspaceUpdater.java:162)
        at hudson.scm.subversion.WorkspaceUpdater$UpdateTask.delegateTo(WorkspaceUpdater.java:170)
        at hudson.scm.subversion.UpdateUpdater$TaskImpl.perform(UpdateUpdater.java:134)
        at hudson.scm.subversion.WorkspaceUpdater$UpdateTask.delegateTo(WorkspaceUpdater.java:162)
        at hudson.scm.SubversionSCM$CheckOutTask.perform(SubversionSCM.java:1001)
        at hudson.scm.SubversionSCM$CheckOutTask.invoke(SubversionSCM.java:977)
        at hudson.scm.SubversionSCM$CheckOutTask.invoke(SubversionSCM.java:953)
        at hudson.FilePath$FileCallableWrapper.call(FilePath.java:2739)
        at hudson.remoting.UserRequest.perform(UserRequest.java:153)
        at hudson.remoting.UserRequest.perform(UserRequest.java:50)
        at hudson.remoting.Request$2.run(Request.java:336)
        at hudson.remoting.InterceptingExecutorService$1.call(InterceptingExecutorService.java:68)
        at java.util.concurrent.FutureTask.run(FutureTask.java:266)
        at java.util.concurrent.ThreadPoolExecutor.runWorker(ThreadPoolExecutor.java:1142)
        at java.util.concurrent.ThreadPoolExecutor$Worker.run(ThreadPoolExecutor.java:617)
        at java.lang.Thread.run(Thread.java:748)
Caused: java.io.IOException: Failed to check out https://svn.apache.org/repos/asf/openjpa/trunk
        at hudson.scm.subversion.CheckoutUpdater$1.perform(CheckoutUpdater.java:130)
        at hudson.scm.subversion.WorkspaceUpdater$UpdateTask.delegateTo(WorkspaceUpdater.java:162)
        at hudson.scm.subversion.WorkspaceUpdater$UpdateTask.delegateTo(WorkspaceUpdater.java:170)
        at hudson.scm.subversion.UpdateUpdater$TaskImpl.perform(UpdateUpdater.java:134)
        at hudson.scm.subversion.WorkspaceUpdater$UpdateTask.delegateTo(WorkspaceUpdater.java:162)
        at hudson.scm.SubversionSCM$CheckOutTask.perform(SubversionSCM.java:1001)
        at hudson.scm.SubversionSCM$CheckOutTask.invoke(SubversionSCM.java:977)
        at hudson.scm.SubversionSCM$CheckOutTask.invoke(SubversionSCM.java:953)
        at hudson.FilePath$FileCallableWrapper.call(FilePath.java:2739)
        at hudson.remoting.UserRequest.perform(UserRequest.java:153)
        at hudson.remoting.UserRequest.perform(UserRequest.java:50)
        at hudson.remoting.Request$2.run(Request.java:336)
        at hudson.remoting.InterceptingExecutorService$1.call(InterceptingExecutorService.java:68)
        at java.util.concurrent.FutureTask.run(FutureTask.java:266)
        at java.util.concurrent.ThreadPoolExecutor.runWorker(ThreadPoolExecutor.java:1142)
        at java.util.concurrent.ThreadPoolExecutor$Worker.run(ThreadPoolExecutor.java:617)
        at java.lang.Thread.run(Thread.java:748)
        at ......remote call to cassandra11(Native Method)
        at hudson.remoting.Channel.attachCallSiteStackTrace(Channel.java:1545)
        at hudson.remoting.UserResponse.retrieve(UserRequest.java:253)
        at hudson.remoting.Channel.call(Channel.java:830)
        at hudson.FilePath.act(FilePath.java:986)
Caused: java.io.IOException: remote file operation failed: <https://builds.apache.org/job/OpenJPA-trunk/ws/> at hudson.remoting.Channel@4b90aef1:cassandra11
        at hudson.FilePath.act(FilePath.java:993)
        at hudson.FilePath.act(FilePath.java:975)
        at hudson.scm.SubversionSCM.checkout(SubversionSCM.java:902)
        at hudson.scm.SubversionSCM.checkout(SubversionSCM.java:838)
        at hudson.scm.SCM.checkout(SCM.java:495)
        at hudson.model.AbstractProject.checkout(AbstractProject.java:1276)
        at hudson.model.AbstractBuild$AbstractBuildExecution.defaultCheckout(AbstractBuild.java:560)
        at jenkins.scm.SCMCheckoutStrategy.checkout(SCMCheckoutStrategy.java:86)
        at hudson.model.AbstractBuild$AbstractBuildExecution.run(AbstractBuild.java:485)
        at hudson.model.Run.execute(Run.java:1735)
        at hudson.maven.MavenModuleSetBuild.run(MavenModuleSetBuild.java:542)
        at hudson.model.ResourceController.execute(ResourceController.java:97)
        at hudson.model.Executor.run(Executor.java:405)
Retrying after 10 seconds
Checking out a fresh workspace because <https://builds.apache.org/job/OpenJPA-trunk/ws/trunk> doesn't exist
Cleaning local Directory trunk
Checking out https://svn.apache.org/repos/asf/openjpa/trunk at revision '2017-07-26T13:20:14.478 +0000'
ERROR: Failed to check out https://svn.apache.org/repos/asf/openjpa/trunk
org.tmatesoft.svn.core.SVNException: svn: E175002: unknown host
svn: E175002: OPTIONS request failed on '/repos/asf/openjpa/trunk'
        at org.tmatesoft.svn.core.internal.wc.SVNErrorManager.error(SVNErrorManager.java:112)
        at org.tmatesoft.svn.core.internal.wc.SVNErrorManager.error(SVNErrorManager.java:96)
        at org.tmatesoft.svn.core.internal.io.dav.http.HTTPConnection.request(HTTPConnection.java:803)
        at org.tmatesoft.svn.core.internal.io.dav.http.HTTPConnection.request(HTTPConnection.java:391)
        at org.tmatesoft.svn.core.internal.io.dav.http.HTTPConnection.request(HTTPConnection.java:379)
        at org.tmatesoft.svn.core.internal.io.dav.DAVConnection.performHttpRequest(DAVConnection.java:862)
        at org.tmatesoft.svn.core.internal.io.dav.DAVConnection.exchangeCapabilities(DAVConnection.java:698)
        at org.tmatesoft.svn.core.internal.io.dav.DAVConnection.open(DAVConnection.java:118)
        at org.tmatesoft.svn.core.internal.io.dav.DAVRepository.openConnection(DAVRepository.java:1049)
        at org.tmatesoft.svn.core.internal.io.dav.DAVRepository.getLatestRevision(DAVRepository.java:189)
        at org.tmatesoft.svn.core.internal.wc2.ng.SvnNgRepositoryAccess.getRevisionNumber(SvnNgRepositoryAccess.java:119)
        at org.tmatesoft.svn.core.internal.wc2.SvnRepositoryAccess.getLocations(SvnRepositoryAccess.java:195)
        at org.tmatesoft.svn.core.internal.wc2.ng.SvnNgRepositoryAccess.createRepositoryFor(SvnNgRepositoryAccess.java:46)
        at org.tmatesoft.svn.core.internal.wc2.ng.SvnNgAbstractUpdate.checkout(SvnNgAbstractUpdate.java:815)
        at org.tmatesoft.svn.core.internal.wc2.ng.SvnNgCheckout.run(SvnNgCheckout.java:26)
        at org.tmatesoft.svn.core.internal.wc2.ng.SvnNgCheckout.run(SvnNgCheckout.java:11)
        at org.tmatesoft.svn.core.internal.wc2.ng.SvnNgOperationRunner.run(SvnNgOperationRunner.java:20)
        at org.tmatesoft.svn.core.internal.wc2.SvnOperationRunner.run(SvnOperationRunner.java:21)
        at org.tmatesoft.svn.core.wc2.SvnOperationFactory.run(SvnOperationFactory.java:1235)
        at org.tmatesoft.svn.core.wc2.SvnOperation.run(SvnOperation.java:294)
        at hudson.scm.subversion.CheckoutUpdater$1.perform(CheckoutUpdater.java:119)
        at hudson.scm.subversion.WorkspaceUpdater$UpdateTask.delegateTo(WorkspaceUpdater.java:162)
        at hudson.scm.subversion.WorkspaceUpdater$UpdateTask.delegateTo(WorkspaceUpdater.java:170)
        at hudson.scm.subversion.UpdateUpdater$TaskImpl.perform(UpdateUpdater.java:134)
        at hudson.scm.subversion.WorkspaceUpdater$UpdateTask.delegateTo(WorkspaceUpdater.java:162)
        at hudson.scm.SubversionSCM$CheckOutTask.perform(SubversionSCM.java:1001)
        at hudson.scm.SubversionSCM$CheckOutTask.invoke(SubversionSCM.java:977)
        at hudson.scm.SubversionSCM$CheckOutTask.invoke(SubversionSCM.java:953)
        at hudson.FilePath$FileCallableWrapper.call(FilePath.java:2739)
        at hudson.remoting.UserRequest.perform(UserRequest.java:153)
        at hudson.remoting.UserRequest.perform(UserRequest.java:50)
        at hudson.remoting.Request$2.run(Request.java:336)
        at hudson.remoting.InterceptingExecutorService$1.call(InterceptingExecutorService.java:68)
        at java.util.concurrent.FutureTask.run(FutureTask.java:266)
        at java.util.concurrent.ThreadPoolExecutor.runWorker(ThreadPoolExecutor.java:1142)
        at java.util.concurrent.ThreadPoolExecutor$Worker.run(ThreadPoolExecutor.java:617)
        at java.lang.Thread.run(Thread.java:748)
Caused by: java.net.UnknownHostException: svn.apache.org: Temporary failure in name resolution
        at java.net.Inet6AddressImpl.lookupAllHostAddr(Native Method)
        at java.net.InetAddress$2.lookupAllHostAddr(InetAddress.java:928)
        at java.net.InetAddress.getAddressesFromNameService(InetAddress.java:1323)
        at java.net.InetAddress.getAllByName0(InetAddress.java:1276)
        at java.net.InetAddress.getAllByName(InetAddress.java:1192)
        at java.net.InetAddress.getAllByName(InetAddress.java:1126)
        at java.net.InetAddress.getByName(InetAddress.java:1076)
        at org.tmatesoft.svn.core.internal.util.SVNSocketFactory.createAddres(SVNSocketFactory.java:205)
        at org.tmatesoft.svn.core.internal.util.SVNSocketFactory._createSSLSocket(SVNSocketFactory.java:105)
        at org.tmatesoft.svn.core.internal.util.SVNSocketFactory.createSSLSocket(SVNSocketFactory.java:92)
        at org.tmatesoft.svn.core.internal.io.dav.http.HTTPConnection.connect(HTTPConnection.java:275)
        at org.tmatesoft.svn.core.internal.io.dav.http.HTTPConnection.request(HTTPConnection.java:454)
        ... 34 more
java.net.UnknownHostException: svn.apache.org: Temporary failure in name resolution
        at java.net.Inet6AddressImpl.lookupAllHostAddr(Native Method)
        at java.net.InetAddress$2.lookupAllHostAddr(InetAddress.java:928)
        at java.net.InetAddress.getAddressesFromNameService(InetAddress.java:1323)
        at java.net.InetAddress.getAllByName0(InetAddress.java:1276)
        at java.net.InetAddress.getAllByName(InetAddress.java:1192)
        at java.net.InetAddress.getAllByName(InetAddress.java:1126)
        at java.net.InetAddress.getByName(InetAddress.java:1076)
        at org.tmatesoft.svn.core.internal.util.SVNSocketFactory.createAddres(SVNSocketFactory.java:205)
        at org.tmatesoft.svn.core.internal.util.SVNSocketFactory._createSSLSocket(SVNSocketFactory.java:105)
        at org.tmatesoft.svn.core.internal.util.SVNSocketFactory.createSSLSocket(SVNSocketFactory.java:92)
        at org.tmatesoft.svn.core.internal.io.dav.http.HTTPConnection.connect(HTTPConnection.java:275)
        at org.tmatesoft.svn.core.internal.io.dav.http.HTTPConnection.request(HTTPConnection.java:454)
Caused: org.tmatesoft.svn.core.SVNException: svn: E175002: unknown host
svn: E175002: OPTIONS request failed on '/repos/asf/openjpa/trunk'
        at org.tmatesoft.svn.core.internal.wc.SVNErrorManager.error(SVNErrorManager.java:112)
        at org.tmatesoft.svn.core.internal.wc.SVNErrorManager.error(SVNErrorManager.java:96)
        at org.tmatesoft.svn.core.internal.io.dav.http.HTTPConnection.request(HTTPConnection.java:803)
        at org.tmatesoft.svn.core.internal.io.dav.http.HTTPConnection.request(HTTPConnection.java:391)
        at org.tmatesoft.svn.core.internal.io.dav.http.HTTPConnection.request(HTTPConnection.java:379)
        at org.tmatesoft.svn.core.internal.io.dav.DAVConnection.performHttpRequest(DAVConnection.java:862)
        at org.tmatesoft.svn.core.internal.io.dav.DAVConnection.exchangeCapabilities(DAVConnection.java:698)
        at org.tmatesoft.svn.core.internal.io.dav.DAVConnection.open(DAVConnection.java:118)
        at org.tmatesoft.svn.core.internal.io.dav.DAVRepository.openConnection(DAVRepository.java:1049)
        at org.tmatesoft.svn.core.internal.io.dav.DAVRepository.getLatestRevision(DAVRepository.java:189)
        at org.tmatesoft.svn.core.internal.wc2.ng.SvnNgRepositoryAccess.getRevisionNumber(SvnNgRepositoryAccess.java:119)
        at org.tmatesoft.svn.core.internal.wc2.SvnRepositoryAccess.getLocations(SvnRepositoryAccess.java:195)
        at org.tmatesoft.svn.core.internal.wc2.ng.SvnNgRepositoryAccess.createRepositoryFor(SvnNgRepositoryAccess.java:46)
        at org.tmatesoft.svn.core.internal.wc2.ng.SvnNgAbstractUpdate.checkout(SvnNgAbstractUpdate.java:815)
        at org.tmatesoft.svn.core.internal.wc2.ng.SvnNgCheckout.run(SvnNgCheckout.java:26)
        at org.tmatesoft.svn.core.internal.wc2.ng.SvnNgCheckout.run(SvnNgCheckout.java:11)
        at org.tmatesoft.svn.core.internal.wc2.ng.SvnNgOperationRunner.run(SvnNgOperationRunner.java:20)
        at org.tmatesoft.svn.core.internal.wc2.SvnOperationRunner.run(SvnOperationRunner.java:21)
        at org.tmatesoft.svn.core.wc2.SvnOperationFactory.run(SvnOperationFactory.java:1235)
        at org.tmatesoft.svn.core.wc2.SvnOperation.run(SvnOperation.java:294)
        at hudson.scm.subversion.CheckoutUpdater$1.perform(CheckoutUpdater.java:119)
        at hudson.scm.subversion.WorkspaceUpdater$UpdateTask.delegateTo(WorkspaceUpdater.java:162)
        at hudson.scm.subversion.WorkspaceUpdater$UpdateTask.delegateTo(WorkspaceUpdater.java:170)
        at hudson.scm.subversion.UpdateUpdater$TaskImpl.perform(UpdateUpdater.java:134)
        at hudson.scm.subversion.WorkspaceUpdater$UpdateTask.delegateTo(WorkspaceUpdater.java:162)
        at hudson.scm.SubversionSCM$CheckOutTask.perform(SubversionSCM.java:1001)
        at hudson.scm.SubversionSCM$CheckOutTask.invoke(SubversionSCM.java:977)
        at hudson.scm.SubversionSCM$CheckOutTask.invoke(SubversionSCM.java:953)
        at hudson.FilePath$FileCallableWrapper.call(FilePath.java:2739)
        at hudson.remoting.UserRequest.perform(UserRequest.java:153)
        at hudson.remoting.UserRequest.perform(UserRequest.java:50)
        at hudson.remoting.Request$2.run(Request.java:336)
        at hudson.remoting.InterceptingExecutorService$1.call(InterceptingExecutorService.java:68)
        at java.util.concurrent.FutureTask.run(FutureTask.java:266)
        at java.util.concurrent.ThreadPoolExecutor.runWorker(ThreadPoolExecutor.java:1142)
        at java.util.concurrent.ThreadPoolExecutor$Worker.run(ThreadPoolExecutor.java:617)
        at java.lang.Thread.run(Thread.java:748)
Caused: java.io.IOException: Failed to check out https://svn.apache.org/repos/asf/openjpa/trunk
        at hudson.scm.subversion.CheckoutUpdater$1.perform(CheckoutUpdater.java:130)
        at hudson.scm.subversion.WorkspaceUpdater$UpdateTask.delegateTo(WorkspaceUpdater.java:162)
        at hudson.scm.subversion.WorkspaceUpdater$UpdateTask.delegateTo(WorkspaceUpdater.java:170)
        at hudson.scm.subversion.UpdateUpdater$TaskImpl.perform(UpdateUpdater.java:134)
        at hudson.scm.subversion.WorkspaceUpdater$UpdateTask.delegateTo(WorkspaceUpdater.java:162)
        at hudson.scm.SubversionSCM$CheckOutTask.perform(SubversionSCM.java:1001)
        at hudson.scm.SubversionSCM$CheckOutTask.invoke(SubversionSCM.java:977)
        at hudson.scm.SubversionSCM$CheckOutTask.invoke(SubversionSCM.java:953)
        at hudson.FilePath$FileCallableWrapper.call(FilePath.java:2739)
        at hudson.remoting.UserRequest.perform(UserRequest.java:153)
        at hudson.remoting.UserRequest.perform(UserRequest.java:50)
        at hudson.remoting.Request$2.run(Request.java:336)
        at hudson.remoting.InterceptingExecutorService$1.call(InterceptingExecutorService.java:68)
        at java.util.concurrent.FutureTask.run(FutureTask.java:266)
        at java.util.concurrent.ThreadPoolExecutor.runWorker(ThreadPoolExecutor.java:1142)
        at java.util.concurrent.ThreadPoolExecutor$Worker.run(ThreadPoolExecutor.java:617)
        at java.lang.Thread.run(Thread.java:748)
        at ......remote call to cassandra11(Native Method)
        at hudson.remoting.Channel.attachCallSiteStackTrace(Channel.java:1545)
        at hudson.remoting.UserResponse.retrieve(UserRequest.java:253)
        at hudson.remoting.Channel.call(Channel.java:830)
        at hudson.FilePath.act(FilePath.java:986)
Caused: java.io.IOException: remote file operation failed: <https://builds.apache.org/job/OpenJPA-trunk/ws/> at hudson.remoting.Channel@4b90aef1:cassandra11
        at hudson.FilePath.act(FilePath.java:993)
        at hudson.FilePath.act(FilePath.java:975)
        at hudson.scm.SubversionSCM.checkout(SubversionSCM.java:902)
        at hudson.scm.SubversionSCM.checkout(SubversionSCM.java:838)
        at hudson.scm.SCM.checkout(SCM.java:495)
        at hudson.model.AbstractProject.checkout(AbstractProject.java:1276)
        at hudson.model.AbstractBuild$AbstractBuildExecution.defaultCheckout(AbstractBuild.java:560)
        at jenkins.scm.SCMCheckoutStrategy.checkout(SCMCheckoutStrategy.java:86)
        at hudson.model.AbstractBuild$AbstractBuildExecution.run(AbstractBuild.java:485)
        at hudson.model.Run.execute(Run.java:1735)
        at hudson.maven.MavenModuleSetBuild.run(MavenModuleSetBuild.java:542)
        at hudson.model.ResourceController.execute(ResourceController.java:97)
        at hudson.model.Executor.run(Executor.java:405)
Loading...